{"text_format":"1","workbook":"xlsx","n_sheets":4,"sheets":["INDEX","IMPERIAL","METRIC","DATA"],"not_rendered":{"charts":0,"images":1,"macros":1,"external_links":0,"defined_names":11,"comments":0,"pivot_tables":0},"unopened":[],"bounds":{"document_bytes":16777216,"sheet_cells":100000,"rows_first":2000,"rows_last":500,"rows_between":2000,"halvings":0,"cell_chars":16384,"cell_head_chars":4096},"cells_cut":0,"cells_raw":0,"read":"whole","date_system":"1900"}

{"sheet":"INDEX","index":0,"n_rows":4,"n_cols":4,"rows_kept":4,"cut":false,"hidden":false,"merged":[[1,3,1,13],[2,2,2,5],[2,7,2,9],[14,2,14,3],[3,2,4,12]]}
[]
[null,null,null,"    Teadit Torque Calculation and Bolt Stress Check"]
[]
[null,"","Select the desired Dimensional Units:"]

{"sheet":"IMPERIAL","index":1,"n_rows":41,"n_cols":12,"rows_kept":41,"cut":false,"hidden":false,"merged":[[1,3,1,13],[2,2,2,5],[4,2,4,3],[4,7,4,12],[5,2,5,3],[5,8,5,12],[6,2,6,3],[6,8,6,12],[7,2,7,3],[7,8,7,12],[10,7,10,12],[38,1,38,13],[40,1,40,13],[9,2,10,5],[14,2,14,3],[24,1,24,13],[26,1,26,13],[34,1,34,13],[36,1,36,13],[11,2,11,3],[11,8,11,12],[12,2,12,3],[12,8,12,12],[13,2,13,3],[13,8,13,12]]}
[]
[null,null,null,"Torque Calculation and Bolt Stress Check for Packing Installation"]
[null,null,"Valve",null,null,null,null,null,null,null,null,"Packing Style:"]
[]
[null,null,"Stem Diameter [in]",null,null,null,null,"Required Torque"]
[null,null,"Packing Cross-Section [in]",null,null,null,null,{"$f":"IFERROR(ROUND((DATA!Q10+IF($E$8>0,$E$8,0))*(($E$5+2*$E$6)^2-$E$5^2)*PI()/4*$E$15*$E$14/12/$E$7,0)&\" lbf.ft\",\"\")","v":""},{"$f":"IF(AND(H12>0.75,H12<>\"\"),\"Not recommended. Exceeds 75% of max bolt yield stress.\",IF(M3=2236,DATA!Q13,\"Recommended Torque\"))","v":"Recommended Torque"}]
[null,null,"Number of Bolts",null,null,null,null,{"$f":"IFERROR(ROUND((8000+IF($E$8>0,$E$8,0))*(($E$5+2*$E$6)^2-$E$5^2)*PI()/4*$E$15*$E$14/12/$E$7,0)&\" lbf.ft\",\"\")","v":""},{"$f":"IF(AND(H13>0.75,H13<>\"\"),\"Not recommended. Exceeds 75% of max bolt yield stress.\",DATA!Q14)","v":"Acceptable for \"General Service Valves\" **"}]
[null,null,"Media Pressure [psi]",null,null,null,null,{"$f":"IFERROR(ROUND((5100+IF($E$8>0,$E$8,0))*(($E$5+2*$E$6)^2-$E$5^2)*PI()/4*$E$15*$E$14/12/$E$7,0)&\" lbf.ft\",\"\")","v":""},{"$f":"IF(AND(H14>0.75,H14<>\"\"),\"Not recommended. Exceeds 75% of max bolt yield stress.\",DATA!Q15)","v":"Minimum Value for \"General Service Valves\" **"}]
[]
[null,null,"Bolt"]
[null,null,null,null,null,null,null,"% of Bolt Max. Yield"]
[null,null,"Bolt Grade/Material",null,null,null,null,{"$f":"IFERROR(((DATA!Q10+ABS($E$8))*(($E$5+2*$E$6)^2-$E$5^2)*PI()/4/$E$7)/(VLOOKUP(E12&E14&E13,DATA!B2:F1094,5,FALSE)*(VLOOKUP(E14,DATA!J10:L36,2,FALSE))*1000),\"\")","v":""},{"$f":"IF(M3=2236,DATA!Q13,\"Maximum Bolt Yield Stress\")","v":"Maximum Bolt Yield Stress"}]
[null,null,"Bolt Class",null,1,null,null,{"$f":"IFERROR(((7977+ABS($E$8))*(($E$5+2*$E$6)^2-$E$5^2)*PI()/4/$E$7)/(VLOOKUP(E12&E14&E13,DATA!B2:F1094,5,FALSE)*(VLOOKUP(E14,DATA!J10:L36,2,FALSE))*1000),\"\")","v":""},"Acceptable for \"General Service Valves\" **"]
[null,null,"Bolt Diameter [in]",null,null,null,null,{"$f":"IFERROR(((5076+ABS($E$8))*(($E$5+2*$E$6)^2-$E$5^2)*PI()/4/$E$7)/(VLOOKUP(E12&E14&E13,DATA!B2:F1094,5,FALSE)*(VLOOKUP(E14,DATA!J10:L36,2,FALSE))*1000),\"\")","v":""},"Minimum Value for \"General Service Valves\" **"]
[null,null,"\"k\" Factor",null,0.16]
[]
[]
[]
[null,"TORQUE WRENCHES MUST BE USED"]
[]
[null,"* Certified Low-Emissions"]
[null,"(1.) Established protocol is essential and must be maintained"]
[]
[null,"** General Service"]
[null,"(1.) Targeted torque Certified Low Emissions service is goal. However, yielding of equipment is not recommended to achieve this value. \nA \"Compression Set\" for the packing is the desired effect."]
[]
[null,"(2.) At least 50% of the torque value of \"Valves Certified Low Emission Service\" is necessary to achieve success with 2236 as a General Service packing. Bolting capable of delivering calculated torque values must be used. Adjust k-factor in formula to match thread lubricant used."]
[]
[null,"(3.) 50% of initial preload (\"General Service Minimum Suggested Value\") is delivered to equipment."]
[]
[null,"(4.) If 50% initial preload is not achievable without yielding equipment, consultation with Teadit Engineering is required."]
[]
[null,"(5.) Equipment is checked to see if cycling is achievable, compressing the first ring in the process."]
[]
[null,"(6.) If cycling is possible, increase torque value to 60% of initial preload, compressing the second ring in the process. Check to see if cycling is achievable."]
[]
[null,"(7.) If cycling is possible at 60%, increase torque value to 70% (\"Acceptable for General Service Valves\"), compressing the third ring in the process. Check to see if cycling is achievable."]
[]
[null,"(8.) If cycling is possible at 70%, continue with the same process for rings 4 and 5. If cycling is not possible, revert to 60%, and continue with rings 4 and 5."]
[]
[null,"(9.) Equipment must be allowed to relax, as per LE protocol, 3 to 5 days. At this time, a retightening at the same finish value in Step 8 is performed."]

{"sheet":"METRIC","index":2,"n_rows":41,"n_cols":12,"rows_kept":41,"cut":false,"hidden":false,"merged":[[1,3,1,13],[2,2,2,5],[4,2,4,3],[4,7,4,12],[5,2,5,3],[5,8,5,12],[6,2,6,3],[6,8,6,12],[7,2,7,3],[7,8,7,12],[10,7,10,12],[38,1,38,13],[40,1,40,13],[9,2,10,5],[14,2,14,3],[24,1,24,13],[26,1,26,13],[34,1,34,13],[36,1,36,13],[11,2,11,3],[11,8,11,12],[12,2,12,3],[12,8,12,12],[13,2,13,3],[13,8,13,12]]}
[]
[null,null,null,"Torque Calculation and Bolt Stress Check for Packing Installation"]
[null,null,"Valve",null,null,null,null,null,null,null,null,"Packing Style:"]
[]
[null,null,"Stem Diameter [mm]",null,null,null,null,"Required Torque"]
[null,null,"Packing Cross-Section [mm]",null,null,null,null,{"$f":"IFERROR(ROUND((DATA!R10+IF($E$8>0,$E$8,0)/10)*(($E$5+2*$E$6)^2-$E$5^2)*PI()/4*$E$15*($F$14*25.4)/1000/$E$7,0)&\" N.m\",\"\")","v":""},{"$f":"IF(AND(H12>0.75,H12<>\"\"),\"Not recommended. Exceeds 75% of max bolt yield stress.\",IF(M3=2236,DATA!Q13,\"Recommended Torque\"))","v":"Recommended Torque"}]
[null,null,"Number of Bolts",null,null,null,null,{"$f":"IFERROR(ROUND((55+IF($E$8>0,$E$8,0)/10)*(($E$5+2*$E$6)^2-$E$5^2)*PI()/4*$E$15*($F$14*25.4)/1000/$E$7,0)&\" N.m\",\"\")","v":""},{"$f":"IF(AND(H13>0.75,H13<>\"\"),\"Not recommended. Exceeds 75% of max bolt yield stress.\",DATA!Q14)","v":"Acceptable for \"General Service Valves\" **"}]
[null,null,"Media Pressure [bar]",null,null,null,null,{"$f":"IFERROR(ROUND((35+IF($E$8>0,$E$8,0)/10)*(($E$5+2*$E$6)^2-$E$5^2)*PI()/4*$E$15*($F$14*25.4)/1000/$E$7,0)&\" N.m\",\"\")","v":""},{"$f":"IF(AND(H14>0.75,H14<>\"\"),\"Not recommended. Exceeds 75% of max bolt yield stress.\",DATA!Q15)","v":"Minimum Value for \"General Service Valves\" **"}]
[]
[null,null,"Bolt"]
[null,null,null,null,null,null,null,"% of Bolt Max. Yield"]
[null,null,"Bolt Grade/Material",null,null,null,null,{"$f":"IFERROR(((DATA!R10+IF($E$8>0,$E$8/10,0))*(($E$5+2*$E$6)^2-$E$5^2)*PI()/4/$E$7)*0.224809/(VLOOKUP(E12&F14&E13,DATA!B2:F1094,5,FALSE)*(VLOOKUP(F14,DATA!J10:L36,2,FALSE))*1000),\"\")","v":""},{"$f":"IF(M3=2236,DATA!Q13,\"Maximum Bolt Yield Stress\")","v":"Maximum Bolt Yield Stress"}]
[null,null,"Bolt Class",null,1,null,null,{"$f":"IFERROR(((55+IF($E$8>0,$E$8/10,0))*(($E$5+2*$E$6)^2-$E$5^2)*PI()/4/$E$7)*0.224809/(VLOOKUP(E12&F14&E13,DATA!B2:F1094,5,FALSE)*(VLOOKUP(F14,DATA!J10:L36,2,FALSE))*1000),\"\")","v":""},"Acceptable for \"General Service Valves\" **"]
[null,null,"Bolt Diameter [mm]",null,null,{"$f":"VLOOKUP(Db/25.4,DATA!J11:J36,1,-1)","v":{"$error":"#N/A"}},null,{"$f":"IFERROR(((35+IF($E$8>0,$E$8/10,0))*(($E$5+2*$E$6)^2-$E$5^2)*PI()/4/$E$7)*0.224809/(VLOOKUP(E12&F14&E13,DATA!B2:F1094,5,FALSE)*(VLOOKUP(F14,DATA!J10:L36,2,FALSE))*1000),\"\")","v":""},"Minimum Value for \"General Service Valves\" **"]
[null,null,"\"k\" Factor",null,0.16]
[]
[]
[]
[null,"TORQUE WRENCHES MUST BE USED"]
[]
[null,"* Certified Low-Emissions"]
[null,"(1.) Established protocol is essential and must be maintained"]
[]
[null,"** General Service"]
[null,"(1.) Targeted torque Certified Low Emissions service is goal. However, yielding of equipment is not recommended to achieve this value. \nA \"Compression Set\" for the packing is the desired effect."]
[]
[null,"(2.) At least 50% of the torque value of \"Valves Certified Low Emission Service\" is necessary to achieve success with 2236 as a General Service packing. Bolting capable of delivering calculated torque values must be used. Adjust k-factor in formula to match thread lubricant used."]
[]
[null,"(3.) 50% of initial preload (\"General Service Minimum Suggested Value\") is delivered to equipment."]
[]
[null,"(4.) If 50% initial preload is not achievable without yielding equipment, consultation with Teadit Engineering is required."]
[]
[null,"(5.) Equipment is checked to see if cycling is achievable, compressing the first ring in the process."]
[]
[null,"(6.) If cycling is possible, increase torque value to 60% of initial preload, compressing the second ring in the process. Check to see if cycling is achievable."]
[]
[null,"(7.) If cycling is possible at 60%, increase torque value to 70% (\"Acceptable for General Service Valves\"), compressing the third ring in the process. Check to see if cycling is achievable."]
[]
[null,"(8.) If cycling is possible at 70%, continue with the same process for rings 4 and 5. If cycling is not possible, revert to 60%, and continue with rings 4 and 5."]
[]
[null,"(9.) Equipment must be allowed to relax, as per LE protocol, 3 to 5 days. At this time, a retightening at the same finish value in Step 8 is performed."]

{"sheet":"DATA","index":3,"n_rows":1094,"n_cols":18,"rows_kept":1094,"cut":false,"hidden":true,"merged":[[13,16,13,20],[14,16,14,20],[1,9,1,11],[8,9,8,11],[8,13,8,14],[11,16,11,20],[12,16,12,20]]}
[1]
[null,"Aux","Grade","Diameter [in]","Class","Yield Stress [ksi]",null,"Grade/Material List",null,"Sealing Confidence Level",null,null,null,"Class 1/2",null,"Class List"]
[null,{"$f":"CONCATENATE(C3,D3,E3,)","v":"651A0,251"},"651A",0.25,1,60,null,"651A",null,1,35,{"$f":"K3*145.0368","v":5076.2879999999996},null,"B8",null,1]
[null,"651A0,31251","651A",0.3125,1,60,null,"651B",null,2,45,{"$f":"K4*145.0368","v":6526.6559999999999},null,"B8C",null,2]
[null,"651A0,3751","651A",0.375,1,60,null,"660A",null,3,55,7977.0240000000003,null,"B8M"]
[null,"651A0,43751","651A",0.4375,1,60,null,"660B",null,4,65,9427.3919999999998,null,"B8T"]
[null,"651A0,51","651A",0.5,1,60,null,"B16",null,5,73,10587.686400000001]
[null,"651A0,56251","651A",0.5625,1,60,null,"B4B"]
[null,"651A0,6251","651A",0.625,1,60,null,"B4C",null,"Root and Tensile Stress Area",null,null,null,"Packing 'y' [MPa]",null,null,"Imperial [psi]","Metric [MPa]"]
[null,"651A0,751","651A",0.75,1,60,null,"B5",null,"Diameter [in]","Root [in²]","Tensile [in²]",null,null,0,null,{"$f":"(VLOOKUP(IMPERIAL!M3,DATA!N11:O18,2,)*145.036839)","v":{"$error":"#N/A"}},{"$f":"VLOOKUP(METRIC!M3,DATA!N11:O18,2,0)","v":{"$error":"#N/A"}}]
[null,"651A0,8751","651A",0.875,1,60,null,"B6",null,0.25,2.69E-2,3.1800000000000002E-2,null,"2000IC",35]
[null,"651A11","651A",1,1,60,null,"B7",null,0.3125,4.5400000000000003E-2,5.2400000000000002E-2,null,"2000S",25,null,"Torque Recommendation"]
[null,"651A1,1251","651A",1.125,1,60,null,"B7M",null,0.375,6.7799999999999999E-2,7.7499999999999999E-2,null,"2005FDA",25,null,"Recommended for \"Certified Low Emission\" Valves *"]
[null,"651A1,251","651A",1.25,1,60,null,"B8",null,0.4375,9.3299999999999994E-2,0.10630000000000001,null,2202,20,null,"Acceptable for \"General Service Valves\" **"]
[null,"651A1,3751","651A",1.375,1,60,null,"B8C",null,0.5,0.12570000000000001,0.1419,null,2235,55,null,"Minimum Value for \"General Service Valves\" **"]
[null,"651A1,51","651A",1.5,1,60,null,"B8F",null,0.5625,0.16200000000000001,0.182,null,2236,73]
[null,"651A1,6251","651A",1.625,1,60,null,"B8M",null,0.625,0.20169999999999999,0.22600000000000001,null,2237,73]
[null,"651A1,751","651A",1.75,1,60,null,"B8T",null,0.75,0.3019,0.33450000000000002,null,"2005R",4]
[null,"651A1,8751","651A",1.875,1,60,null,"BC",null,0.875,0.41920000000000002,0.4617]
[null,"651A21","651A",2,1,60,null,"BD",null,1,0.55089999999999995,0.60570000000000002]
[null,"651A2,251","651A",2.25,1,60,null,"L43",null,1.125,0.72760000000000002,0.79049999999999998]
[null,"651A2,51","651A",2.5,1,60,null,"L7",null,1.25,0.92889999999999995,0.99970000000000003]
[null,"651A2,751","651A",2.75,1,60,null,"L7A",null,1.375,1.155,1.234]
[null,"651A31","651A",3,1,70,null,"L7B",null,1.5,1.405,1.492]
[null,"651A3,251","651A",3.25,1,70,null,"L7C",null,1.625,1.68,1.7749999999999999]
[null,"651A3,51","651A",3.5,1,70,null,"L7M",null,1.75,1.9790000000000001,2.0819999999999999]
[null,"651A3,751","651A",3.75,1,70,null,"3.6",null,1.875,2.3029999999999999,2.4140000000000001]
[null,"651A41","651A",4,1,70,null,"4.6",null,2,2.6520000000000001,2.7709999999999999]
[null,"651B0,251","651B",0.25,1,50,null,"4.8",null,2.25,3.4220000000000002,3.5569999999999999]
[null,"651B0,31251","651B",0.3125,1,50,null,"5.6",null,2.5,4.2910000000000004,4.4420000000000002]
[null,"651B0,3751","651B",0.375,1,50,null,"5.8",null,2.75,5.258,5.4249999999999998]
[null,"651B0,43751","651B",0.4375,1,50,null,"6.8",null,3,6.3239999999999998,6.5060000000000002]
[null,"651B0,51","651B",0.5,1,50,null,"8.8",null,3.25,7.4870000000000001,7.6859999999999999]
[null,"651B0,56251","651B",0.5625,1,50,null,"9.8",null,3.5,8.7479999999999993,8.9629999999999992]
[null,"651B0,6251","651B",0.625,1,50,null,"10.9",null,3.75,10.11,10.34]
[null,"651B0,751","651B",0.75,1,50,null,"12.9",null,4,11.57,11.81]
[null,"651B0,8751","651B",0.875,1,50,null,"A2/A4-70"]
[null,"651B11","651B",1,1,50,null,"25CrMo4",null,"Dia. Metric","Rt. [mm²]","Tensile [mm²]"]
[null,"651B1,1251","651B",1.125,1,50,null,"42CrMo4",null,"M14-2",102.1,115.4]
[null,"651B1,251","651B",1.25,1,50,null,"I718",null,"M16-2",141,156.69999999999999]
[null,"651B1,3751","651B",1.375,1,50,null,null,null,"M20-2.5",220.4,244.8]
[null,"651B1,51","651B",1.5,1,50,null,null,null,"M24-3",317.3,352.5]
[null,"651B1,6251","651B",1.625,1,50,null,null,null,"M27-3",419.1,459.4]
[null,"651B1,751","651B",1.75,1,50,null,null,null,"M30-3",535,580.4]
[null,"651B1,8751","651B",1.875,1,50,null,null,null,"M33-3",665.1,715.6]
[null,"651B21","651B",2,1,50,null,null,null,"M36-3",809.3,864.9]
[null,"651B2,251","651B",2.25,1,50,null,null,null,"M39-3",976.6,1028]
[null,"651B2,51","651B",2.5,1,50,null,null,null,"M42-3",1140,1206]
[null,"651B2,751","651B",2.75,1,50,null,null,null,"M45-3",1327,1398]
[null,"651B31","651B",3,1,60,null,null,null,"M48-3",1527,1604]
[null,"651B3,251","651B",3.25,1,60,null,null,null,"M52-3",1817,1900]
[null,"651B3,51","651B",3.5,1,60,null,null,null,"M56-3",2132,2222]
[null,"651B3,751","651B",3.75,1,60,null,null,null,"M64-3",2837,2940]
[null,"651B41","651B",4,1,60,null,null,null,"M70-3",3432,3545]
[null,"660A0,251","660A",0.25,1,85,null,null,null,"M76-3",4083,4207]
[null,"660A0,31251","660A",0.3125,1,85,null,null,null,"M82-3",4791,4925]
[null,"660A0,3751","660A",0.375,1,85,null,null,null,"M90-3",5822,5970]
[null,"660A0,43751","660A",0.4375,1,85,null,null,null,"M95-3",6518,6674]
[null,"660A0,51","660A",0.5,1,85,null,null,null,"M100-3",7253,7418]
[null,"660A0,56251","660A",0.5625,1,85]
[null,"660A0,6251","660A",0.625,1,85]
[null,"660A0,751","660A",0.75,1,85]
[null,"660A0,8751","660A",0.875,1,85]
[null,"660A11","660A",1,1,85]
[null,"660A1,1251","660A",1.125,1,85]
[null,"660A1,251","660A",1.25,1,85]
[null,{"$f":"CONCATENATE(C67,D67,E67,)","v":"660A1,3751"},"660A",1.375,1,85]
[null,"660A1,51","660A",1.5,1,85]
[null,"660A1,6251","660A",1.625,1,85]
[null,"660A1,751","660A",1.75,1,85]
[null,"660A1,8751","660A",1.875,1,85]
[null,"660A21","660A",2,1,85]
[null,"660A2,251","660A",2.25,1,85]
[null,"660A2,51","660A",2.5,1,85]
[null,"660A2,751","660A",2.75,1,85]
[null,"660A31","660A",3,1,85]
[null,"660A3,251","660A",3.25,1,85]
[null,"660A3,51","660A",3.5,1,85]
[null,"660A3,751","660A",3.75,1,85]
[null,"660A41","660A",4,1,85]
[null,"660B0,251","660B",0.25,1,85]
[null,"660B0,31251","660B",0.3125,1,85]
[null,"660B0,3751","660B",0.375,1,85]
[null,"660B0,43751","660B",0.4375,1,85]
[null,"660B0,51","660B",0.5,1,85]
[null,"660B0,56251","660B",0.5625,1,85]
[null,"660B0,6251","660B",0.625,1,85]
[null,"660B0,751","660B",0.75,1,85]
[null,"660B0,8751","660B",0.875,1,85]
[null,"660B11","660B",1,1,85]
[null,"660B1,1251","660B",1.125,1,85]
[null,"660B1,251","660B",1.25,1,85]
[null,"660B1,3751","660B",1.375,1,85]
[null,"660B1,51","660B",1.5,1,85]
[null,"660B1,6251","660B",1.625,1,85]
[null,"660B1,751","660B",1.75,1,85]
[null,"660B1,8751","660B",1.875,1,85]
[null,"660B21","660B",2,1,85]
[null,"660B2,251","660B",2.25,1,85]
[null,"660B2,51","660B",2.5,1,85]
[null,"660B2,751","660B",2.75,1,85]
[null,"660B31","660B",3,1,85]
[null,"660B3,251","660B",3.25,1,85]
[null,"660B3,51","660B",3.5,1,85]
[null,"660B3,751","660B",3.75,1,85]
[null,"660B41","660B",4,1,85]
[null,"B160,251","B16",0.25,1,105]
[null,"B160,31251","B16",0.3125,1,105]
[null,"B160,3751","B16",0.375,1,105]
[null,"B160,43751","B16",0.4375,1,105]
[null,"B160,51","B16",0.5,1,105]
[null,"B160,56251","B16",0.5625,1,105]
[null,"B160,6251","B16",0.625,1,105]
[null,"B160,751","B16",0.75,1,105]
[null,"B160,8751","B16",0.875,1,105]
[null,"B1611","B16",1,1,105]
[null,"B161,1251","B16",1.125,1,105]
[null,"B161,251","B16",1.25,1,105]
[null,"B161,3751","B16",1.375,1,105]
[null,"B161,51","B16",1.5,1,105]
[null,"B161,6251","B16",1.625,1,105]
[null,"B161,751","B16",1.75,1,105]
[null,"B161,8751","B16",1.875,1,105]
[null,"B1621","B16",2,1,105]
[null,"B162,251","B16",2.25,1,105]
[null,"B162,51","B16",2.5,1,105]
[null,"B162,751","B16",2.75,1,95]
[null,"B1631","B16",3,1,95]
[null,"B163,251","B16",3.25,1,95]
[null,"B163,51","B16",3.5,1,95]
[null,{"$f":"CONCATENATE(C131,D131,E131,)","v":"B163,751"},"B16",3.75,1,95]
[null,"B1641","B16",4,1,95]
[null,"B4B0,251","B4B",0.25,1,105]
[null,"B4B0,31251","B4B",0.3125,1,105]
[null,"B4B0,3751","B4B",0.375,1,105]
[null,"B4B0,43751","B4B",0.4375,1,105]
[null,"B4B0,51","B4B",0.5,1,105]
[null,"B4B0,56251","B4B",0.5625,1,105]
[null,"B4B0,6251","B4B",0.625,1,105]
[null,"B4B0,751","B4B",0.75,1,105]
[null,"B4B0,8751","B4B",0.875,1,105]
[null,"B4B11","B4B",1,1,105]
[null,"B4B1,1251","B4B",1.125,1,105]
[null,"B4B1,251","B4B",1.25,1,105]
[null,"B4B1,3751","B4B",1.375,1,105]
[null,"B4B1,51","B4B",1.5,1,105]
[null,"B4B1,6251","B4B",1.625,1,105]
[null,"B4B1,751","B4B",1.75,1,105]
[null,"B4B1,8751","B4B",1.875,1,105]
[null,"B4B21","B4B",2,1,105]
[null,"B4B2,251","B4B",2.25,1,105]
[null,"B4B2,51","B4B",2.5,1,105]
[null,"B4B2,751","B4B",2.75,1,105]
[null,"B4B31","B4B",3,1,105]
[null,"B4B3,251","B4B",3.25,1,105]
[null,"B4B3,51","B4B",3.5,1,105]
[null,"B4B3,751","B4B",3.75,1,105]
[null,"B4B41","B4B",4,1,105]
[null,"B4C0,251","B4C",0.25,1,85]
[null,"B4C0,31251","B4C",0.3125,1,85]
[null,"B4C0,3751","B4C",0.375,1,85]
[null,"B4C0,43751","B4C",0.4375,1,85]
[null,"B4C0,51","B4C",0.5,1,85]
[null,"B4C0,56251","B4C",0.5625,1,85]
[null,"B4C0,6251","B4C",0.625,1,85]
[null,"B4C0,751","B4C",0.75,1,85]
[null,"B4C0,8751","B4C",0.875,1,85]
[null,"B4C11","B4C",1,1,85]
[null,"B4C1,1251","B4C",1.125,1,85]
[null,"B4C1,251","B4C",1.25,1,85]
[null,"B4C1,3751","B4C",1.375,1,85]
[null,"B4C1,51","B4C",1.5,1,85]
[null,"B4C1,6251","B4C",1.625,1,85]
[null,"B4C1,751","B4C",1.75,1,85]
[null,"B4C1,8751","B4C",1.875,1,85]
[null,"B4C21","B4C",2,1,85]
[null,"B4C2,251","B4C",2.25,1,85]
[null,"B4C2,51","B4C",2.5,1,85]
[null,"B4C2,751","B4C",2.75,1,85]
[null,"B4C31","B4C",3,1,85]
[null,"B4C3,251","B4C",3.25,1,85]
[null,"B4C3,51","B4C",3.5,1,85]
[null,"B4C3,751","B4C",3.75,1,85]
[null,"B4C41","B4C",4,1,85]
[null,"B50,251","B5",0.25,1,100]
[null,"B50,31251","B5",0.3125,1,100]
[null,"B50,3751","B5",0.375,1,100]
[null,"B50,43751","B5",0.4375,1,100]
[null,"B50,51","B5",0.5,1,100]
[null,"B50,56251","B5",0.5625,1,100]
[null,"B50,6251","B5",0.625,1,100]
[null,"B50,751","B5",0.75,1,100]
[null,"B50,8751","B5",0.875,1,100]
[null,"B511","B5",1,1,100]
[null,{"$f":"CONCATENATE(C195,D195,E195,)","v":"B51,1251"},"B5",1.125,1,100]
[null,"B51,251","B5",1.25,1,100]
[null,"B51,3751","B5",1.375,1,100]
[null,"B51,51","B5",1.5,1,100]
[null,"B51,6251","B5",1.625,1,100]
[null,"B51,751","B5",1.75,1,100]
{"$rows_left_out":894}