{"text_format":"1","workbook":"xlsx","n_sheets":4,"sheets":["INDEX","IMPERIAL","METRIC","DATA"],"not_rendered":{"charts":0,"images":1,"macros":1,"external_links":0,"defined_names":11,"comments":0,"pivot_tables":0},"unopened":[],"bounds":{"document_bytes":16777216,"sheet_cells":100000,"rows_first":2000,"rows_last":500,"rows_between":2000,"halvings":0,"cell_chars":16384,"cell_head_chars":4096},"cells_cut":0,"cells_raw":0,"read":"whole","date_system":"1900"}

{"sheet":"INDEX","index":0,"n_rows":4,"n_cols":4,"rows_kept":4,"cut":false,"hidden":false,"merged":[[1,3,1,13],[2,2,2,5],[2,7,2,9],[14,2,14,3],[3,2,4,12]]}
[]
[null,null,null,"    Teadit Torque Calculation and Bolt Stress Check"]
[]
[null,"","Select the desired Dimensional Units:"]

{"sheet":"IMPERIAL","index":1,"n_rows":41,"n_cols":12,"rows_kept":41,"cut":false,"hidden":false,"merged":[[1,3,1,13],[2,2,2,5],[4,2,4,3],[4,7,4,12],[5,2,5,3],[5,8,5,12],[6,2,6,3],[6,8,6,12],[7,2,7,3],[7,8,7,12],[10,7,10,12],[38,1,38,13],[40,1,40,13],[9,2,10,5],[14,2,14,3],[24,1,24,13],[26,1,26,13],[34,1,34,13],[36,1,36,13],[11,2,11,3],[11,8,11,12],[12,2,12,3],[12,8,12,12],[13,2,13,3],[13,8,13,12]]}
[]
[null,null,null,"Torque Calculation and Bolt Stress Check for Packing Installation"]
[null,null,"Valve",null,null,null,null,null,null,null,null,"Packing Style:"]
[]
[null,null,"Stem Diameter [in]",null,null,null,null,"Required Torque"]
[null,null,"Packing Cross-Section [in]",null,null,null,null,{"$f":"IFERROR(ROUND((DATA!Q10+IF($E$8>0,$E$8,0))*(($E$5+2*$E$6)^2-$E$5^2)*PI()/4*$E$15*$E$14/12/$E$7,0)&\" lbf.ft\",\"\")","v":""},{"$f":"IF(AND(H12>0.75,H12<>\"\"),\"Not recommended. Exceeds 75% of max bolt yield stress.\",IF(M3=2236,DATA!Q13,\"Recommended Torque\"))","v":"Recommended Torque"}]
[null,null,"Number of Bolts",null,null,null,null,{"$f":"IFERROR(ROUND((8000+IF($E$8>0,$E$8,0))*(($E$5+2*$E$6)^2-$E$5^2)*PI()/4*$E$15*$E$14/12/$E$7,0)&\" lbf.ft\",\"\")","v":""},{"$f":"IF(AND(H13>0.75,H13<>\"\"),\"Not recommended. Exceeds 75% of max bolt yield stress.\",DATA!Q14)","v":"Acceptable for \"General Service Valves\" **"}]
[null,null,"Media Pressure [psi]",null,null,null,null,{"$f":"IFERROR(ROUND((5100+IF($E$8>0,$E$8,0))*(($E$5+2*$E$6)^2-$E$5^2)*PI()/4*$E$15*$E$14/12/$E$7,0)&\" lbf.ft\",\"\")","v":""},{"$f":"IF(AND(H14>0.75,H14<>\"\"),\"Not recommended. Exceeds 75% of max bolt yield stress.\",DATA!Q15)","v":"Minimum Value for \"General Service Valves\" **"}]
[]
[null,null,"Bolt"]
[null,null,null,null,null,null,null,"% of Bolt Max. Yield"]
[null,null,"Bolt Grade/Material",null,null,null,null,{"$f":"IFERROR(((DATA!Q10+ABS($E$8))*(($E$5+2*$E$6)^2-$E$5^2)*PI()/4/$E$7)/(VLOOKUP(E12&E14&E13,DATA!B2:F1094,5,FALSE)*(VLOOKUP(E14,DATA!J10:L36,2,FALSE))*1000),\"\")","v":""},{"$f":"IF(M3=2236,DATA!Q13,\"Maximum Bolt Yield Stress\")","v":"Maximum Bolt Yield Stress"}]
[null,null,"Bolt Class",null,1,null,null,{"$f":"IFERROR(((7977+ABS($E$8))*(($E$5+2*$E$6)^2-$E$5^2)*PI()/4/$E$7)/(VLOOKUP(E12&E14&E13,DATA!B2:F1094,5,FALSE)*(VLOOKUP(E14,DATA!J10:L36,2,FALSE))*1000),\"\")","v":""},"Acceptable for \"General Service Valves\" **"]
[null,null,"Bolt Diameter [in]",null,null,null,null,{"$f":"IFERROR(((5076+ABS($E$8))*(($E$5+2*$E$6)^2-$E$5^2)*PI()/4/$E$7)/(VLOOKUP(E12&E14&E13,DATA!B2:F1094,5,FALSE)*(VLOOKUP(E14,DATA!J10:L36,2,FALSE))*1000),\"\")","v":""},"Minimum Value for \"General Service Valves\" **"]
[null,null,"\"k\" Factor",null,0.16]
[]
[]
[]
[null,"TORQUE WRENCHES MUST BE USED"]
[]
[null,"* Certified Low-Emissions"]
[null,"(1.) Established protocol is essential and must be maintained"]
[]
[null,"** General Service"]
[null,"(1.) Targeted torque Certified Low Emissions service is goal. However, yielding of equipment is not recommended to achieve this value. \nA \"Compression Set\" for the packing is the desired effect."]
[]
[null,"(2.) At least 50% of the torque value of \"Valves Certified Low Emission Service\" is necessary to achieve success with 2236 as a General Service packing. Bolting capable of delivering calculated torque values must be used. Adjust k-factor in formula to match thread lubricant used."]
[]
[null,"(3.) 50% of initial preload (\"General Service Minimum Suggested Value\") is delivered to equipment."]
[]
[null,"(4.) If 50% initial preload is not achievable without yielding equipment, consultation with Teadit Engineering is required."]
[]
[null,"(5.) Equipment is checked to see if cycling is achievable, compressing the first ring in the process."]
[]
[null,"(6.) If cycling is possible, increase torque value to 60% of initial preload, compressing the second ring in the process. Check to see if cycling is achievable."]
[]
[null,"(7.) If cycling is possible at 60%, increase torque value to 70% (\"Acceptable for General Service Valves\"), compressing the third ring in the process. Check to see if cycling is achievable."]
[]
[null,"(8.) If cycling is possible at 70%, continue with the same process for rings 4 and 5. If cycling is not possible, revert to 60%, and continue with rings 4 and 5."]
[]
[null,"(9.) Equipment must be allowed to relax, as per LE protocol, 3 to 5 days. At this time, a retightening at the same finish value in Step 8 is performed."]

{"sheet":"METRIC","index":2,"n_rows":41,"n_cols":12,"rows_kept":41,"cut":false,"hidden":false,"merged":[[1,3,1,13],[2,2,2,5],[4,2,4,3],[4,7,4,12],[5,2,5,3],[5,8,5,12],[6,2,6,3],[6,8,6,12],[7,2,7,3],[7,8,7,12],[10,7,10,12],[38,1,38,13],[40,1,40,13],[9,2,10,5],[14,2,14,3],[24,1,24,13],[26,1,26,13],[34,1,34,13],[36,1,36,13],[11,2,11,3],[11,8,11,12],[12,2,12,3],[12,8,12,12],[13,2,13,3],[13,8,13,12]]}
[]
[null,null,null,"Torque Calculation and Bolt Stress Check for Packing Installation"]
[null,null,"Valve",null,null,null,null,null,null,null,null,"Packing Style:"]
[]
[null,null,"Stem Diameter [mm]",null,null,null,null,"Required Torque"]
[null,null,"Packing Cross-Section [mm]",null,null,null,null,{"$f":"IFERROR(ROUND((DATA!R10+IF($E$8>0,$E$8,0)/10)*(($E$5+2*$E$6)^2-$E$5^2)*PI()/4*$E$15*($F$14*25.4)/1000/$E$7,0)&\" N.m\",\"\")","v":""},{"$f":"IF(AND(H12>0.75,H12<>\"\"),\"Not recommended. Exceeds 75% of max bolt yield stress.\",IF(M3=2236,DATA!Q13,\"Recommended Torque\"))","v":"Recommended Torque"}]
[null,null,"Number of Bolts",null,null,null,null,{"$f":"IFERROR(ROUND((55+IF($E$8>0,$E$8,0)/10)*(($E$5+2*$E$6)^2-$E$5^2)*PI()/4*$E$15*($F$14*25.4)/1000/$E$7,0)&\" N.m\",\"\")","v":""},{"$f":"IF(AND(H13>0.75,H13<>\"\"),\"Not recommended. Exceeds 75% of max bolt yield stress.\",DATA!Q14)","v":"Acceptable for \"General Service Valves\" **"}]
[null,null,"Media Pressure [bar]",null,null,null,null,{"$f":"IFERROR(ROUND((35+IF($E$8>0,$E$8,0)/10)*(($E$5+2*$E$6)^2-$E$5^2)*PI()/4*$E$15*($F$14*25.4)/1000/$E$7,0)&\" N.m\",\"\")","v":""},{"$f":"IF(AND(H14>0.75,H14<>\"\"),\"Not recommended. Exceeds 75% of max bolt yield stress.\",DATA!Q15)","v":"Minimum Value for \"General Service Valves\" **"}]
[]
[null,null,"Bolt"]
[null,null,null,null,null,null,null,"% of Bolt Max. Yield"]
[null,null,"Bolt Grade/Material",null,null,null,null,{"$f":"IFERROR(((DATA!R10+IF($E$8>0,$E$8/10,0))*(($E$5+2*$E$6)^2-$E$5^2)*PI()/4/$E$7)*0.224809/(VLOOKUP(E12&F14&E13,DATA!B2:F1094,5,FALSE)*(VLOOKUP(F14,DATA!J10:L36,2,FALSE))*1000),\"\")","v":""},{"$f":"IF(M3=2236,DATA!Q13,\"Maximum Bolt Yield Stress\")","v":"Maximum Bolt Yield Stress"}]
[null,null,"Bolt Class",null,1,null,null,{"$f":"IFERROR(((55+IF($E$8>0,$E$8/10,0))*(($E$5+2*$E$6)^2-$E$5^2)*PI()/4/$E$7)*0.224809/(VLOOKUP(E12&F14&E13,DATA!B2:F1094,5,FALSE)*(VLOOKUP(F14,DATA!J10:L36,2,FALSE))*1000),\"\")","v":""},"Acceptable for \"General Service Valves\" **"]
[null,null,"Bolt Diameter [mm]",null,null,{"$f":"VLOOKUP(Db/25.4,DATA!J11:J36,1,-1)","v":{"$error":"#N/A"}},null,{"$f":"IFERROR(((35+IF($E$8>0,$E$8/10,0))*(($E$5+2*$E$6)^2-$E$5^2)*PI()/4/$E$7)*0.224809/(VLOOKUP(E12&F14&E13,DATA!B2:F1094,5,FALSE)*(VLOOKUP(F14,DATA!J10:L36,2,FALSE))*1000),\"\")","v":""},"Minimum Value for \"General Service Valves\" **"]
[null,null,"\"k\" Factor",null,0.16]
[]
[]
[]
[null,"TORQUE WRENCHES MUST BE USED"]
[]
[null,"* Certified Low-Emissions"]
[null,"(1.) Established protocol is essential and must be maintained"]
[]
[null,"** General Service"]
[null,"(1.) Targeted torque Certified Low Emissions service is goal. However, yielding of equipment is not recommended to achieve this value. \nA \"Compression Set\" for the packing is the desired effect."]
[]
[null,"(2.) At least 50% of the torque value of \"Valves Certified Low Emission Service\" is necessary to achieve success with 2236 as a General Service packing. Bolting capable of delivering calculated torque values must be used. Adjust k-factor in formula to match thread lubricant used."]
[]
[null,"(3.) 50% of initial preload (\"General Service Minimum Suggested Value\") is delivered to equipment."]
[]
[null,"(4.) If 50% initial preload is not achievable without yielding equipment, consultation with Teadit Engineering is required."]
[]
[null,"(5.) Equipment is checked to see if cycling is achievable, compressing the first ring in the process."]
[]
[null,"(6.) If cycling is possible, increase torque value to 60% of initial preload, compressing the second ring in the process. Check to see if cycling is achievable."]
[]
[null,"(7.) If cycling is possible at 60%, increase torque value to 70% (\"Acceptable for General Service Valves\"), compressing the third ring in the process. Check to see if cycling is achievable."]
[]
[null,"(8.) If cycling is possible at 70%, continue with the same process for rings 4 and 5. If cycling is not possible, revert to 60%, and continue with rings 4 and 5."]
[]
[null,"(9.) Equipment must be allowed to relax, as per LE protocol, 3 to 5 days. At this time, a retightening at the same finish value in Step 8 is performed."]

{"sheet":"DATA","index":3,"n_rows":1094,"n_cols":18,"rows_kept":1094,"cut":false,"hidden":true,"merged":[[13,16,13,20],[14,16,14,20],[1,9,1,11],[8,9,8,11],[8,13,8,14],[11,16,11,20],[12,16,12,20]]}
[1]
[null,"Aux","Grade","Diameter [in]","Class","Yield Stress [ksi]",null,"Grade/Material List",null,"Sealing Confidence Level",null,null,null,"Class 1/2",null,"Class List"]
[null,{"$f":"CONCATENATE(C3,D3,E3,)","v":"651A0,251"},"651A",0.25,1,60,null,"651A",null,1,35,{"$f":"K3*145.0368","v":5076.2879999999996},null,"B8",null,1]
[null,"651A0,31251","651A",0.3125,1,60,null,"651B",null,2,45,{"$f":"K4*145.0368","v":6526.6559999999999},null,"B8C",null,2]
[null,"651A0,3751","651A",0.375,1,60,null,"660A",null,3,55,7977.0240000000003,null,"B8M"]
[null,"651A0,43751","651A",0.4375,1,60,null,"660B",null,4,65,9427.3919999999998,null,"B8T"]
[null,"651A0,51","651A",0.5,1,60,null,"B16",null,5,73,10587.686400000001]
[null,"651A0,56251","651A",0.5625,1,60,null,"B4B"]
[null,"651A0,6251","651A",0.625,1,60,null,"B4C",null,"Root and Tensile Stress Area",null,null,null,"Packing 'y' [MPa]",null,null,"Imperial [psi]","Metric [MPa]"]
[null,"651A0,751","651A",0.75,1,60,null,"B5",null,"Diameter [in]","Root [in²]","Tensile [in²]",null,null,0,null,{"$f":"(VLOOKUP(IMPERIAL!M3,DATA!N11:O18,2,)*145.036839)","v":{"$error":"#N/A"}},{"$f":"VLOOKUP(METRIC!M3,DATA!N11:O18,2,0)","v":{"$error":"#N/A"}}]
[null,"651A0,8751","651A",0.875,1,60,null,"B6",null,0.25,2.69E-2,3.1800000000000002E-2,null,"2000IC",35]
[null,"651A11","651A",1,1,60,null,"B7",null,0.3125,4.5400000000000003E-2,5.2400000000000002E-2,null,"2000S",25,null,"Torque Recommendation"]
[null,"651A1,1251","651A",1.125,1,60,null,"B7M",null,0.375,6.7799999999999999E-2,7.7499999999999999E-2,null,"2005FDA",25,null,"Recommended for \"Certified Low Emission\" Valves *"]
[null,"651A1,251","651A",1.25,1,60,null,"B8",null,0.4375,9.3299999999999994E-2,0.10630000000000001,null,2202,20,null,"Acceptable for \"General Service Valves\" **"]
[null,"651A1,3751","651A",1.375,1,60,null,"B8C",null,0.5,0.12570000000000001,0.1419,null,2235,55,null,"Minimum Value for \"General Service Valves\" **"]
[null,"651A1,51","651A",1.5,1,60,null,"B8F",null,0.5625,0.16200000000000001,0.182,null,2236,73]
[null,"651A1,6251","651A",1.625,1,60,null,"B8M",null,0.625,0.20169999999999999,0.22600000000000001,null,2237,73]
[null,"651A1,751","651A",1.75,1,60,null,"B8T",null,0.75,0.3019,0.33450000000000002,null,"2005R",4]
[null,"651A1,8751","651A",1.875,1,60,null,"BC",null,0.875,0.41920000000000002,0.4617]
[null,"651A21","651A",2,1,60,null,"BD",null,1,0.55089999999999995,0.60570000000000002]
[null,"651A2,251","651A",2.25,1,60,null,"L43",null,1.125,0.72760000000000002,0.79049999999999998]
[null,"651A2,51","651A",2.5,1,60,null,"L7",null,1.25,0.92889999999999995,0.99970000000000003]
[null,"651A2,751","651A",2.75,1,60,null,"L7A",null,1.375,1.155,1.234]
[null,"651A31","651A",3,1,70,null,"L7B",null,1.5,1.405,1.492]
[null,"651A3,251","651A",3.25,1,70,null,"L7C",null,1.625,1.68,1.7749999999999999]
[null,"651A3,51","651A",3.5,1,70,null,"L7M",null,1.75,1.9790000000000001,2.0819999999999999]
[null,"651A3,751","651A",3.75,1,70,null,"3.6",null,1.875,2.3029999999999999,2.4140000000000001]
[null,"651A41","651A",4,1,70,null,"4.6",null,2,2.6520000000000001,2.7709999999999999]
[null,"651B0,251","651B",0.25,1,50,null,"4.8",null,2.25,3.4220000000000002,3.5569999999999999]
[null,"651B0,31251","651B",0.3125,1,50,null,"5.6",null,2.5,4.2910000000000004,4.4420000000000002]
[null,"651B0,3751","651B",0.375,1,50,null,"5.8",null,2.75,5.258,5.4249999999999998]
[null,"651B0,43751","651B",0.4375,1,50,null,"6.8",null,3,6.3239999999999998,6.5060000000000002]
[null,"651B0,51","651B",0.5,1,50,null,"8.8",null,3.25,7.4870000000000001,7.6859999999999999]
[null,"651B0,56251","651B",0.5625,1,50,null,"9.8",null,3.5,8.7479999999999993,8.9629999999999992]
[null,"651B0,6251","651B",0.625,1,50,null,"10.9",null,3.75,10.11,10.34]
[null,"651B0,751","651B",0.75,1,50,null,"12.9",null,4,11.57,11.81]
[null,"651B0,8751","651B",0.875,1,50,null,"A2/A4-70"]
[null,"651B11","651B",1,1,50,null,"25CrMo4",null,"Dia. Metric","Rt. [mm²]","Tensile [mm²]"]
[null,"651B1,1251","651B",1.125,1,50,null,"42CrMo4",null,"M14-2",102.1,115.4]
[null,"651B1,251","651B",1.25,1,50,null,"I718",null,"M16-2",141,156.69999999999999]
[null,"651B1,3751","651B",1.375,1,50,null,null,null,"M20-2.5",220.4,244.8]
[null,"651B1,51","651B",1.5,1,50,null,null,null,"M24-3",317.3,352.5]
[null,"651B1,6251","651B",1.625,1,50,null,null,null,"M27-3",419.1,459.4]
[null,"651B1,751","651B",1.75,1,50,null,null,null,"M30-3",535,580.4]
[null,"651B1,8751","651B",1.875,1,50,null,null,null,"M33-3",665.1,715.6]
[null,"651B21","651B",2,1,50,null,null,null,"M36-3",809.3,864.9]
[null,"651B2,251","651B",2.25,1,50,null,null,null,"M39-3",976.6,1028]
[null,"651B2,51","651B",2.5,1,50,null,null,null,"M42-3",1140,1206]
[null,"651B2,751","651B",2.75,1,50,null,null,null,"M45-3",1327,1398]
[null,"651B31","651B",3,1,60,null,null,null,"M48-3",1527,1604]
[null,"651B3,251","651B",3.25,1,60,null,null,null,"M52-3",1817,1900]
[null,"651B3,51","651B",3.5,1,60,null,null,null,"M56-3",2132,2222]
[null,"651B3,751","651B",3.75,1,60,null,null,null,"M64-3",2837,2940]
[null,"651B41","651B",4,1,60,null,null,null,"M70-3",3432,3545]
[null,"660A0,251","660A",0.25,1,85,null,null,null,"M76-3",4083,4207]
[null,"660A0,31251","660A",0.3125,1,85,null,null,null,"M82-3",4791,4925]
[null,"660A0,3751","660A",0.375,1,85,null,null,null,"M90-3",5822,5970]
[null,"660A0,43751","660A",0.4375,1,85,null,null,null,"M95-3",6518,6674]
[null,"660A0,51","660A",0.5,1,85,null,null,null,"M100-3",7253,7418]
[null,"660A0,56251","660A",0.5625,1,85]
[null,"660A0,6251","660A",0.625,1,85]
[null,"660A0,751","660A",0.75,1,85]
[null,"660A0,8751","660A",0.875,1,85]
[null,"660A11","660A",1,1,85]
[null,"660A1,1251","660A",1.125,1,85]
[null,"660A1,251","660A",1.25,1,85]
[null,{"$f":"CONCATENATE(C67,D67,E67,)","v":"660A1,3751"},"660A",1.375,1,85]
[null,"660A1,51","660A",1.5,1,85]
[null,"660A1,6251","660A",1.625,1,85]
[null,"660A1,751","660A",1.75,1,85]
[null,"660A1,8751","660A",1.875,1,85]
[null,"660A21","660A",2,1,85]
[null,"660A2,251","660A",2.25,1,85]
[null,"660A2,51","660A",2.5,1,85]
[null,"660A2,751","660A",2.75,1,85]
[null,"660A31","660A",3,1,85]
[null,"660A3,251","660A",3.25,1,85]
[null,"660A3,51","660A",3.5,1,85]
[null,"660A3,751","660A",3.75,1,85]
[null,"660A41","660A",4,1,85]
[null,"660B0,251","660B",0.25,1,85]
[null,"660B0,31251","660B",0.3125,1,85]
[null,"660B0,3751","660B",0.375,1,85]
[null,"660B0,43751","660B",0.4375,1,85]
[null,"660B0,51","660B",0.5,1,85]
[null,"660B0,56251","660B",0.5625,1,85]
[null,"660B0,6251","660B",0.625,1,85]
[null,"660B0,751","660B",0.75,1,85]
[null,"660B0,8751","660B",0.875,1,85]
[null,"660B11","660B",1,1,85]
[null,"660B1,1251","660B",1.125,1,85]
[null,"660B1,251","660B",1.25,1,85]
[null,"660B1,3751","660B",1.375,1,85]
[null,"660B1,51","660B",1.5,1,85]
[null,"660B1,6251","660B",1.625,1,85]
[null,"660B1,751","660B",1.75,1,85]
[null,"660B1,8751","660B",1.875,1,85]
[null,"660B21","660B",2,1,85]
[null,"660B2,251","660B",2.25,1,85]
[null,"660B2,51","660B",2.5,1,85]
[null,"660B2,751","660B",2.75,1,85]
[null,"660B31","660B",3,1,85]
[null,"660B3,251","660B",3.25,1,85]
[null,"660B3,51","660B",3.5,1,85]
[null,"660B3,751","660B",3.75,1,85]
[null,"660B41","660B",4,1,85]
[null,"B160,251","B16",0.25,1,105]
[null,"B160,31251","B16",0.3125,1,105]
[null,"B160,3751","B16",0.375,1,105]
[null,"B160,43751","B16",0.4375,1,105]
[null,"B160,51","B16",0.5,1,105]
[null,"B160,56251","B16",0.5625,1,105]
[null,"B160,6251","B16",0.625,1,105]
[null,"B160,751","B16",0.75,1,105]
[null,"B160,8751","B16",0.875,1,105]
[null,"B1611","B16",1,1,105]
[null,"B161,1251","B16",1.125,1,105]
[null,"B161,251","B16",1.25,1,105]
[null,"B161,3751","B16",1.375,1,105]
[null,"B161,51","B16",1.5,1,105]
[null,"B161,6251","B16",1.625,1,105]
[null,"B161,751","B16",1.75,1,105]
[null,"B161,8751","B16",1.875,1,105]
[null,"B1621","B16",2,1,105]
[null,"B162,251","B16",2.25,1,105]
[null,"B162,51","B16",2.5,1,105]
[null,"B162,751","B16",2.75,1,95]
[null,"B1631","B16",3,1,95]
[null,"B163,251","B16",3.25,1,95]
[null,"B163,51","B16",3.5,1,95]
[null,{"$f":"CONCATENATE(C131,D131,E131,)","v":"B163,751"},"B16",3.75,1,95]
[null,"B1641","B16",4,1,95]
[null,"B4B0,251","B4B",0.25,1,105]
[null,"B4B0,31251","B4B",0.3125,1,105]
[null,"B4B0,3751","B4B",0.375,1,105]
[null,"B4B0,43751","B4B",0.4375,1,105]
[null,"B4B0,51","B4B",0.5,1,105]
[null,"B4B0,56251","B4B",0.5625,1,105]
[null,"B4B0,6251","B4B",0.625,1,105]
[null,"B4B0,751","B4B",0.75,1,105]
[null,"B4B0,8751","B4B",0.875,1,105]
[null,"B4B11","B4B",1,1,105]
[null,"B4B1,1251","B4B",1.125,1,105]
[null,"B4B1,251","B4B",1.25,1,105]
[null,"B4B1,3751","B4B",1.375,1,105]
[null,"B4B1,51","B4B",1.5,1,105]
[null,"B4B1,6251","B4B",1.625,1,105]
[null,"B4B1,751","B4B",1.75,1,105]
[null,"B4B1,8751","B4B",1.875,1,105]
[null,"B4B21","B4B",2,1,105]
[null,"B4B2,251","B4B",2.25,1,105]
[null,"B4B2,51","B4B",2.5,1,105]
[null,"B4B2,751","B4B",2.75,1,105]
[null,"B4B31","B4B",3,1,105]
[null,"B4B3,251","B4B",3.25,1,105]
[null,"B4B3,51","B4B",3.5,1,105]
[null,"B4B3,751","B4B",3.75,1,105]
[null,"B4B41","B4B",4,1,105]
[null,"B4C0,251","B4C",0.25,1,85]
[null,"B4C0,31251","B4C",0.3125,1,85]
[null,"B4C0,3751","B4C",0.375,1,85]
[null,"B4C0,43751","B4C",0.4375,1,85]
[null,"B4C0,51","B4C",0.5,1,85]
[null,"B4C0,56251","B4C",0.5625,1,85]
[null,"B4C0,6251","B4C",0.625,1,85]
[null,"B4C0,751","B4C",0.75,1,85]
[null,"B4C0,8751","B4C",0.875,1,85]
[null,"B4C11","B4C",1,1,85]
[null,"B4C1,1251","B4C",1.125,1,85]
[null,"B4C1,251","B4C",1.25,1,85]
[null,"B4C1,3751","B4C",1.375,1,85]
[null,"B4C1,51","B4C",1.5,1,85]
[null,"B4C1,6251","B4C",1.625,1,85]
[null,"B4C1,751","B4C",1.75,1,85]
[null,"B4C1,8751","B4C",1.875,1,85]
[null,"B4C21","B4C",2,1,85]
[null,"B4C2,251","B4C",2.25,1,85]
[null,"B4C2,51","B4C",2.5,1,85]
[null,"B4C2,751","B4C",2.75,1,85]
[null,"B4C31","B4C",3,1,85]
[null,"B4C3,251","B4C",3.25,1,85]
[null,"B4C3,51","B4C",3.5,1,85]
[null,"B4C3,751","B4C",3.75,1,85]
[null,"B4C41","B4C",4,1,85]
[null,"B50,251","B5",0.25,1,100]
[null,"B50,31251","B5",0.3125,1,100]
[null,"B50,3751","B5",0.375,1,100]
[null,"B50,43751","B5",0.4375,1,100]
[null,"B50,51","B5",0.5,1,100]
[null,"B50,56251","B5",0.5625,1,100]
[null,"B50,6251","B5",0.625,1,100]
[null,"B50,751","B5",0.75,1,100]
[null,"B50,8751","B5",0.875,1,100]
[null,"B511","B5",1,1,100]
[null,{"$f":"CONCATENATE(C195,D195,E195,)","v":"B51,1251"},"B5",1.125,1,100]
[null,"B51,251","B5",1.25,1,100]
[null,"B51,3751","B5",1.375,1,100]
[null,"B51,51","B5",1.5,1,100]
[null,"B51,6251","B5",1.625,1,100]
[null,"B51,751","B5",1.75,1,100]
[null,"B51,8751","B5",1.875,1,100]
[null,"B521","B5",2,1,100]
[null,"B52,251","B5",2.25,1,100]
[null,"B52,51","B5",2.5,1,100]
[null,"B52,751","B5",2.75,1,100]
[null,"B531","B5",3,1,100]
[null,"B53,251","B5",3.25,1,100]
[null,"B53,51","B5",3.5,1,100]
[null,"B53,751","B5",3.75,1,100]
[null,"B541","B5",4,1,100]
[null,"B60,251","B6",0.25,1,85]
[null,"B60,31251","B6",0.3125,1,85]
[null,"B60,3751","B6",0.375,1,85]
[null,"B60,43751","B6",0.4375,1,85]
[null,"B60,51","B6",0.5,1,85]
[null,"B60,56251","B6",0.5625,1,85]
[null,"B60,6251","B6",0.625,1,85]
[null,"B60,751","B6",0.75,1,85]
[null,"B60,8751","B6",0.875,1,85]
[null,"B611","B6",1,1,85]
[null,"B61,1251","B6",1.125,1,85]
[null,"B61,251","B6",1.25,1,85]
[null,"B61,3751","B6",1.375,1,85]
[null,"B61,51","B6",1.5,1,85]
[null,"B61,6251","B6",1.625,1,85]
[null,"B61,751","B6",1.75,1,85]
[null,"B61,8751","B6",1.875,1,85]
[null,"B621","B6",2,1,85]
[null,"B62,251","B6",2.25,1,85]
[null,"B62,51","B6",2.5,1,85]
[null,"B62,751","B6",2.75,1,85]
[null,"B631","B6",3,1,85]
[null,"B63,251","B6",3.25,1,85]
[null,"B63,51","B6",3.5,1,85]
[null,"B63,751","B6",3.75,1,85]
[null,"B641","B6",4,1,85]
[null,"B70,251","B7",0.25,1,105]
[null,"B70,31251","B7",0.3125,1,105]
[null,"B70,3751","B7",0.375,1,105]
[null,"B70,43751","B7",0.4375,1,105]
[null,"B70,51","B7",0.5,1,105]
[null,"B70,56251","B7",0.5625,1,105]
[null,"B70,6251","B7",0.625,1,105]
[null,"B70,751","B7",0.75,1,105]
[null,"B70,8751","B7",0.875,1,105]
[null,"B711","B7",1,1,105]
[null,"B71,1251","B7",1.125,1,105]
[null,"B71,251","B7",1.25,1,105]
[null,"B71,3751","B7",1.375,1,105]
[null,"B71,51","B7",1.5,1,105]
[null,"B71,6251","B7",1.625,1,105]
[null,"B71,751","B7",1.75,1,105]
[null,"B71,8751","B7",1.875,1,105]
[null,"B721","B7",2,1,105]
[null,"B72,251","B7",2.25,1,105]
[null,"B72,51","B7",2.5,1,105]
[null,"B72,751","B7",2.75,1,95]
[null,"B731","B7",3,1,95]
[null,{"$f":"CONCATENATE(C259,D259,E259,)","v":"B73,251"},"B7",3.25,1,95]
[null,"B73,51","B7",3.5,1,95]
[null,"B73,751","B7",3.75,1,95]
[null,"B741","B7",4,1,95]
[null,"B7M0,251","B7M",0.25,1,80]
[null,"B7M0,31251","B7M",0.3125,1,80]
[null,"B7M0,3751","B7M",0.375,1,80]
[null,"B7M0,43751","B7M",0.4375,1,80]
[null,"B7M0,51","B7M",0.5,1,80]
[null,"B7M0,56251","B7M",0.5625,1,80]
[null,"B7M0,6251","B7M",0.625,1,80]
[null,"B7M0,751","B7M",0.75,1,80]
[null,"B7M0,8751","B7M",0.875,1,80]
[null,"B7M11","B7M",1,1,80]
[null,"B7M1,1251","B7M",1.125,1,80]
[null,"B7M1,251","B7M",1.25,1,80]
[null,"B7M1,3751","B7M",1.375,1,80]
[null,"B7M1,51","B7M",1.5,1,80]
[null,"B7M1,6251","B7M",1.625,1,80]
[null,"B7M1,751","B7M",1.75,1,80]
[null,"B7M1,8751","B7M",1.875,1,80]
[null,"B7M21","B7M",2,1,80]
[null,"B7M2,251","B7M",2.25,1,80]
[null,"B7M2,51","B7M",2.5,1,80]
[null,"B7M2,751","B7M",2.75,1,80]
[null,"B7M31","B7M",3,1,80]
[null,"B7M3,251","B7M",3.25,1,80]
[null,"B7M3,51","B7M",3.5,1,80]
[null,"B7M3,751","B7M",3.75,1,80]
[null,"B7M41","B7M",4,1,80]
[null,"B80,251","B8",0.25,1,30]
[null,"B80,31251","B8",0.3125,1,30]
[null,"B80,3751","B8",0.375,1,30]
[null,"B80,43751","B8",0.4375,1,30]
[null,"B80,51","B8",0.5,1,30]
[null,"B80,56251","B8",0.5625,1,30]
[null,"B80,6251","B8",0.625,1,30]
[null,"B80,751","B8",0.75,1,30]
[null,"B80,8751","B8",0.875,1,30]
[null,"B811","B8",1,1,30]
[null,"B81,1251","B8",1.125,1,30]
[null,"B81,251","B8",1.25,1,30]
[null,"B81,3751","B8",1.375,1,30]
[null,"B81,51","B8",1.5,1,30]
[null,"B81,6251","B8",1.625,1,30]
[null,"B81,751","B8",1.75,1,30]
[null,"B81,8751","B8",1.875,1,30]
[null,"B821","B8",2,1,30]
[null,"B82,251","B8",2.25,1,30]
[null,"B82,51","B8",2.5,1,30]
[null,"B82,751","B8",2.75,1,30]
[null,"B831","B8",3,1,30]
[null,"B83,251","B8",3.25,1,30]
[null,"B83,51","B8",3.5,1,30]
[null,"B83,751","B8",3.75,1,30]
[null,"B841","B8",4,1,30]
[null,"B80,252","B8",0.25,2,100]
[null,"B80,31252","B8",0.3125,2,100]
[null,"B80,3752","B8",0.375,2,100]
[null,"B80,43752","B8",0.4375,2,100]
[null,"B80,52","B8",0.5,2,100]
[null,"B80,56252","B8",0.5625,2,100]
[null,"B80,6252","B8",0.625,2,100]
[null,"B80,752","B8",0.75,2,100]
[null,{"$f":"CONCATENATE(C323,D323,E323,)","v":"B80,8752"},"B8",0.875,2,65]
[null,"B812","B8",1,2,65]
[null,"B81,1252","B8",1.125,2,65]
[null,"B81,252","B8",1.25,2,65]
[null,"B81,3752","B8",1.375,2,50]
[null,"B81,52","B8",1.5,2,50]
[null,"B81,6252","B8",1.625,2,80]
[null,"B81,752","B8",1.75,2,80]
[null,"B81,8752","B8",1.875,2,80]
[null,"B822","B8",2,2,80]
[null,"B82,252","B8",2.25,2,80]
[null,"B82,52","B8",2.5,2,80]
[null,"B82,752","B8",2.75,2,80]
[null,"B832","B8",3,2,80]
[null,"B83,252","B8",3.25,2,80]
[null,"B83,52","B8",3.5,2,80]
[null,"B83,752","B8",3.75,2,80]
[null,"B842","B8",4,2,80]
[null,"B8C0,251","B8C",0.25,1,30]
[null,"B8C0,31251","B8C",0.3125,1,30]
[null,"B8C0,3751","B8C",0.375,1,30]
[null,"B8C0,43751","B8C",0.4375,1,30]
[null,"B8C0,51","B8C",0.5,1,30]
[null,"B8C0,56251","B8C",0.5625,1,30]
[null,"B8C0,6251","B8C",0.625,1,30]
[null,"B8C0,751","B8C",0.75,1,30]
[null,"B8C0,8751","B8C",0.875,1,30]
[null,"B8C11","B8C",1,1,30]
[null,"B8C1,1251","B8C",1.125,1,30]
[null,"B8C1,251","B8C",1.25,1,30]
[null,"B8C1,3751","B8C",1.375,1,30]
[null,"B8C1,51","B8C",1.5,1,30]
[null,"B8C1,6251","B8C",1.625,1,30]
[null,"B8C1,751","B8C",1.75,1,30]
[null,"B8C1,8751","B8C",1.875,1,30]
[null,"B8C21","B8C",2,1,30]
[null,"B8C2,251","B8C",2.25,1,30]
[null,"B8C2,51","B8C",2.5,1,30]
[null,"B8C2,751","B8C",2.75,1,30]
[null,"B8C31","B8C",3,1,30]
[null,"B8C3,251","B8C",3.25,1,30]
[null,"B8C3,51","B8C",3.5,1,30]
[null,"B8C3,751","B8C",3.75,1,30]
[null,"B8C41","B8C",4,1,30]
[null,"B8C0,252","B8C",0.25,2,100]
[null,"B8C0,31252","B8C",0.3125,2,100]
[null,"B8C0,3752","B8C",0.375,2,100]
[null,"B8C0,43752","B8C",0.4375,2,100]
[null,"B8C0,52","B8C",0.5,2,100]
[null,"B8C0,56252","B8C",0.5625,2,100]
[null,"B8C0,6252","B8C",0.625,2,100]
[null,"B8C0,752","B8C",0.75,2,100]
[null,"B8C0,8752","B8C",0.875,2,65]
[null,"B8C12","B8C",1,2,65]
[null,"B8C1,1252","B8C",1.125,2,65]
[null,"B8C1,252","B8C",1.25,2,65]
[null,"B8C1,3752","B8C",1.375,2,50]
[null,"B8C1,52","B8C",1.5,2,50]
[null,"B8C1,6252","B8C",1.625,2,80]
[null,"B8C1,752","B8C",1.75,2,80]
[null,"B8C1,8752","B8C",1.875,2,80]
[null,"B8C22","B8C",2,2,80]
[null,"B8C2,252","B8C",2.25,2,80]
[null,"B8C2,52","B8C",2.5,2,80]
[null,{"$f":"CONCATENATE(C387,D387,E387,)","v":"B8C2,752"},"B8C",2.75,2,80]
[null,"B8C32","B8C",3,2,80]
[null,"B8C3,252","B8C",3.25,2,80]
[null,"B8C3,52","B8C",3.5,2,80]
[null,"B8C3,752","B8C",3.75,2,80]
[null,"B8C42","B8C",4,2,80]
[null,"B8F0,251","B8F",0.25,1,30]
[null,"B8F0,31251","B8F",0.3125,1,30]
[null,"B8F0,3751","B8F",0.375,1,30]
[null,"B8F0,43751","B8F",0.4375,1,30]
[null,"B8F0,51","B8F",0.5,1,30]
[null,"B8F0,56251","B8F",0.5625,1,30]
[null,"B8F0,6251","B8F",0.625,1,30]
[null,"B8F0,751","B8F",0.75,1,30]
[null,"B8F0,8751","B8F",0.875,1,30]
[null,"B8F11","B8F",1,1,30]
[null,"B8F1,1251","B8F",1.125,1,30]
[null,"B8F1,251","B8F",1.25,1,30]
[null,"B8F1,3751","B8F",1.375,1,30]
[null,"B8F1,51","B8F",1.5,1,30]
[null,"B8F1,6251","B8F",1.625,1,30]
[null,"B8F1,751","B8F",1.75,1,30]
[null,"B8F1,8751","B8F",1.875,1,30]
[null,"B8F21","B8F",2,1,30]
[null,"B8F2,251","B8F",2.25,1,30]
[null,"B8F2,51","B8F",2.5,1,30]
[null,"B8F2,751","B8F",2.75,1,30]
[null,"B8F31","B8F",3,1,30]
[null,"B8F3,251","B8F",3.25,1,30]
[null,"B8F3,51","B8F",3.5,1,30]
[null,"B8F3,751","B8F",3.75,1,30]
[null,"B8F41","B8F",4,1,30]
[null,"B8M0,251","B8M",0.25,1,30]
[null,"B8M0,31251","B8M",0.3125,1,30]
[null,"B8M0,3751","B8M",0.375,1,30]
[null,"B8M0,43751","B8M",0.4375,1,30]
[null,"B8M0,51","B8M",0.5,1,30]
[null,"B8M0,56251","B8M",0.5625,1,30]
[null,"B8M0,6251","B8M",0.625,1,30]
[null,"B8M0,751","B8M",0.75,1,30]
[null,"B8M0,8751","B8M",0.875,1,30]
[null,"B8M11","B8M",1,1,30]
[null,"B8M1,1251","B8M",1.125,1,30]
[null,"B8M1,251","B8M",1.25,1,30]
[null,"B8M1,3751","B8M",1.375,1,30]
[null,"B8M1,51","B8M",1.5,1,30]
[null,"B8M1,6251","B8M",1.625,1,30]
[null,"B8M1,751","B8M",1.75,1,30]
[null,"B8M1,8751","B8M",1.875,1,30]
[null,"B8M21","B8M",2,1,30]
[null,"B8M2,251","B8M",2.25,1,30]
[null,"B8M2,51","B8M",2.5,1,30]
[null,"B8M2,751","B8M",2.75,1,30]
[null,"B8M31","B8M",3,1,30]
[null,"B8M3,251","B8M",3.25,1,30]
[null,"B8M3,51","B8M",3.5,1,30]
[null,"B8M3,751","B8M",3.75,1,30]
[null,"B8M41","B8M",4,1,30]
[null,"B8M0,252","B8M",0.25,2,95]
[null,"B8M0,31252","B8M",0.3125,2,95]
[null,"B8M0,3752","B8M",0.375,2,95]
[null,"B8M0,43752","B8M",0.4375,2,95]
[null,"B8M0,52","B8M",0.5,2,95]
[null,"B8M0,56252","B8M",0.5625,2,95]
[null,{"$f":"CONCATENATE(C451,D451,E451,)","v":"B8M0,6252"},"B8M",0.625,2,95]
[null,"B8M0,752","B8M",0.75,2,95]
[null,"B8M0,8752","B8M",0.875,2,65]
[null,"B8M12","B8M",1,2,65]
[null,"B8M1,1252","B8M",1.125,2,65]
[null,"B8M1,252","B8M",1.25,2,65]
[null,"B8M1,3752","B8M",1.375,2,50]
[null,"B8M1,52","B8M",1.5,2,50]
[null,"B8M1,6252","B8M",1.625,2,80]
[null,"B8M1,752","B8M",1.75,2,80]
[null,"B8M1,8752","B8M",1.875,2,80]
[null,"B8M22","B8M",2,2,80]
[null,"B8M2,252","B8M",2.25,2,80]
[null,"B8M2,52","B8M",2.5,2,80]
[null,"B8M2,752","B8M",2.75,2,80]
[null,"B8M32","B8M",3,2,80]
[null,"B8M3,252","B8M",3.25,2,80]
[null,"B8M3,52","B8M",3.5,2,80]
[null,"B8M3,752","B8M",3.75,2,80]
[null,"B8M42","B8M",4,2,80]
[null,"B8T0,251","B8T",0.25,1,30]
[null,"B8T0,31251","B8T",0.3125,1,30]
[null,"B8T0,3751","B8T",0.375,1,30]
[null,"B8T0,43751","B8T",0.4375,1,30]
[null,"B8T0,51","B8T",0.5,1,30]
[null,"B8T0,56251","B8T",0.5625,1,30]
[null,"B8T0,6251","B8T",0.625,1,30]
[null,"B8T0,751","B8T",0.75,1,30]
[null,"B8T0,8751","B8T",0.875,1,30]
[null,"B8T11","B8T",1,1,30]
[null,"B8T1,1251","B8T",1.125,1,30]
[null,"B8T1,251","B8T",1.25,1,30]
[null,"B8T1,3751","B8T",1.375,1,30]
[null,"B8T1,51","B8T",1.5,1,30]
[null,"B8T1,6251","B8T",1.625,1,30]
[null,"B8T1,751","B8T",1.75,1,30]
[null,"B8T1,8751","B8T",1.875,1,30]
[null,"B8T21","B8T",2,1,30]
[null,"B8T2,251","B8T",2.25,1,30]
[null,"B8T2,51","B8T",2.5,1,30]
[null,"B8T2,751","B8T",2.75,1,30]
[null,"B8T31","B8T",3,1,30]
[null,"B8T3,251","B8T",3.25,1,30]
[null,"B8T3,51","B8T",3.5,1,30]
[null,"B8T3,751","B8T",3.75,1,30]
[null,"B8T41","B8T",4,1,30]
[null,"B8T0,252","B8T",0.25,2,100]
[null,"B8T0,31252","B8T",0.3125,2,100]
[null,"B8T0,3752","B8T",0.375,2,100]
[null,"B8T0,43752","B8T",0.4375,2,100]
[null,"B8T0,52","B8T",0.5,2,100]
[null,"B8T0,56252","B8T",0.5625,2,100]
[null,"B8T0,6252","B8T",0.625,2,100]
[null,"B8T0,752","B8T",0.75,2,100]
[null,"B8T0,8752","B8T",0.875,2,65]
[null,"B8T12","B8T",1,2,65]
[null,"B8T1,1252","B8T",1.125,2,65]
[null,"B8T1,252","B8T",1.25,2,65]
[null,"B8T1,3752","B8T",1.375,2,50]
[null,"B8T1,52","B8T",1.5,2,50]
[null,"B8T1,6252","B8T",1.625,2,80]
[null,"B8T1,752","B8T",1.75,2,80]
[null,"B8T1,8752","B8T",1.875,2,80]
[null,"B8T22","B8T",2,2,80]
[null,{"$f":"CONCATENATE(C515,D515,E515,)","v":"B8T2,252"},"B8T",2.25,2,80]
[null,"B8T2,52","B8T",2.5,2,80]
[null,"B8T2,752","B8T",2.75,2,80]
[null,"B8T32","B8T",3,2,80]
[null,"B8T3,252","B8T",3.25,2,80]
[null,"B8T3,52","B8T",3.5,2,80]
[null,"B8T3,752","B8T",3.75,2,80]
[null,"B8T42","B8T",4,2,80]
[null,"BC0,251","BC",0.25,1,99]
[null,"BC0,31251","BC",0.3125,1,99]
[null,"BC0,3751","BC",0.375,1,99]
[null,"BC0,43751","BC",0.4375,1,99]
[null,"BC0,51","BC",0.5,1,99]
[null,"BC0,56251","BC",0.5625,1,99]
[null,"BC0,6251","BC",0.625,1,99]
[null,"BC0,751","BC",0.75,1,99]
[null,"BC0,8751","BC",0.875,1,99]
[null,"BC11","BC",1,1,99]
[null,"BC1,1251","BC",1.125,1,99]
[null,"BC1,251","BC",1.25,1,99]
[null,"BC1,3751","BC",1.375,1,99]
[null,"BC1,51","BC",1.5,1,99]
[null,"BC1,6251","BC",1.625,1,99]
[null,"BC1,751","BC",1.75,1,99]
[null,"BC1,8751","BC",1.875,1,99]
[null,"BC21","BC",2,1,99]
[null,"BC2,251","BC",2.25,1,99]
[null,"BC2,51","BC",2.5,1,99]
[null,"BC2,751","BC",2.75,1,99]
[null,"BC31","BC",3,1,99]
[null,"BC3,251","BC",3.25,1,99]
[null,"BC3,51","BC",3.5,1,99]
[null,"BC3,751","BC",3.75,1,99]
[null,"BC41","BC",4,1,99]
[null,"BD0,251","BD",0.25,1,130]
[null,"BD0,31251","BD",0.3125,1,130]
[null,"BD0,3751","BD",0.375,1,130]
[null,"BD0,43751","BD",0.4375,1,130]
[null,"BD0,51","BD",0.5,1,130]
[null,"BD0,56251","BD",0.5625,1,130]
[null,"BD0,6251","BD",0.625,1,130]
[null,"BD0,751","BD",0.75,1,130]
[null,"BD0,8751","BD",0.875,1,130]
[null,"BD11","BD",1,1,130]
[null,"BD1,1251","BD",1.125,1,130]
[null,"BD1,251","BD",1.25,1,130]
[null,"BD1,3751","BD",1.375,1,130]
[null,"BD1,51","BD",1.5,1,130]
[null,"BD1,6251","BD",1.625,1,130]
[null,"BD1,751","BD",1.75,1,130]
[null,"BD1,8751","BD",1.875,1,130]
[null,"BD21","BD",2,1,130]
[null,"BD2,251","BD",2.25,1,130]
[null,"BD2,51","BD",2.5,1,130]
[null,"BD2,751","BD",2.75,1,130]
[null,"BD31","BD",3,1,130]
[null,"BD3,251","BD",3.25,1,130]
[null,"BD3,51","BD",3.5,1,130]
[null,"BD3,751","BD",3.75,1,130]
[null,"BD41","BD",4,1,130]
[null,"L430,251","L43",0.25,1,105]
[null,"L430,31251","L43",0.3125,1,105]
[null,"L430,3751","L43",0.375,1,105]
[null,"L430,43751","L43",0.4375,1,105]
[null,{"$f":"CONCATENATE(C579,D579,E579,)","v":"L430,51"},"L43",0.5,1,105]
[null,"L430,56251","L43",0.5625,1,105]
[null,"L430,6251","L43",0.625,1,105]
[null,"L430,751","L43",0.75,1,105]
[null,"L430,8751","L43",0.875,1,105]
[null,"L4311","L43",1,1,105]
[null,"L431,1251","L43",1.125,1,105]
[null,"L431,251","L43",1.25,1,105]
[null,"L431,3751","L43",1.375,1,105]
[null,"L431,51","L43",1.5,1,105]
[null,"L431,6251","L43",1.625,1,105]
[null,"L431,751","L43",1.75,1,105]
[null,"L431,8751","L43",1.875,1,105]
[null,"L4321","L43",2,1,105]
[null,"L432,251","L43",2.25,1,105]
[null,"L432,51","L43",2.5,1,105]
[null,"L432,751","L43",2.75,1,105]
[null,"L4331","L43",3,1,105]
[null,"L433,251","L43",3.25,1,105]
[null,"L433,51","L43",3.5,1,105]
[null,"L433,751","L43",3.75,1,105]
[null,"L4341","L43",4,1,105]
[null,"L70,251","L7",0.25,1,105]
[null,"L70,31251","L7",0.3125,1,105]
[null,"L70,3751","L7",0.375,1,105]
[null,"L70,43751","L7",0.4375,1,105]
[null,"L70,51","L7",0.5,1,105]
[null,"L70,56251","L7",0.5625,1,105]
[null,"L70,6251","L7",0.625,1,105]
[null,"L70,751","L7",0.75,1,105]
[null,"L70,8751","L7",0.875,1,105]
[null,"L711","L7",1,1,105]
[null,"L71,1251","L7",1.125,1,105]
[null,"L71,251","L7",1.25,1,105]
[null,"L71,3751","L7",1.375,1,105]
[null,"L71,51","L7",1.5,1,105]
[null,"L71,6251","L7",1.625,1,105]
[null,"L71,751","L7",1.75,1,105]
[null,"L71,8751","L7",1.875,1,105]
[null,"L721","L7",2,1,105]
[null,"L72,251","L7",2.25,1,105]
[null,"L72,51","L7",2.5,1,105]
[null,"L72,751","L7",2.75,1,105]
[null,"L731","L7",3,1,105]
[null,"L73,251","L7",3.25,1,105]
[null,"L73,51","L7",3.5,1,105]
[null,"L73,751","L7",3.75,1,105]
[null,"L741","L7",4,1,105]
[null,"L7A0,251","L7A",0.25,1,105]
[null,"L7A0,31251","L7A",0.3125,1,105]
[null,"L7A0,3751","L7A",0.375,1,105]
[null,"L7A0,43751","L7A",0.4375,1,105]
[null,"L7A0,51","L7A",0.5,1,105]
[null,"L7A0,56251","L7A",0.5625,1,105]
[null,"L7A0,6251","L7A",0.625,1,105]
[null,"L7A0,751","L7A",0.75,1,105]
[null,"L7A0,8751","L7A",0.875,1,105]
[null,"L7A11","L7A",1,1,105]
[null,"L7A1,1251","L7A",1.125,1,105]
[null,"L7A1,251","L7A",1.25,1,105]
[null,"L7A1,3751","L7A",1.375,1,105]
[null,"L7A1,51","L7A",1.5,1,105]
[null,"L7A1,6251","L7A",1.625,1,105]
[null,"L7A1,751","L7A",1.75,1,105]
[null,{"$f":"CONCATENATE(C643,D643,E643,)","v":"L7A1,8751"},"L7A",1.875,1,105]
[null,"L7A21","L7A",2,1,105]
[null,"L7A2,251","L7A",2.25,1,105]
[null,"L7A2,51","L7A",2.5,1,105]
[null,"L7A2,751","L7A",2.75,1,105]
[null,"L7A31","L7A",3,1,105]
[null,"L7A3,251","L7A",3.25,1,105]
[null,"L7A3,51","L7A",3.5,1,105]
[null,"L7A3,751","L7A",3.75,1,105]
[null,"L7A41","L7A",4,1,105]
[null,"L7B0,251","L7B",0.25,1,105]
[null,"L7B0,31251","L7B",0.3125,1,105]
[null,"L7B0,3751","L7B",0.375,1,105]
[null,"L7B0,43751","L7B",0.4375,1,105]
[null,"L7B0,51","L7B",0.5,1,105]
[null,"L7B0,56251","L7B",0.5625,1,105]
[null,"L7B0,6251","L7B",0.625,1,105]
[null,"L7B0,751","L7B",0.75,1,105]
[null,"L7B0,8751","L7B",0.875,1,105]
[null,"L7B11","L7B",1,1,105]
[null,"L7B1,1251","L7B",1.125,1,105]
[null,"L7B1,251","L7B",1.25,1,105]
[null,"L7B1,3751","L7B",1.375,1,105]
[null,"L7B1,51","L7B",1.5,1,105]
[null,"L7B1,6251","L7B",1.625,1,105]
[null,"L7B1,751","L7B",1.75,1,105]
[null,"L7B1,8751","L7B",1.875,1,105]
[null,"L7B21","L7B",2,1,105]
[null,"L7B2,251","L7B",2.25,1,105]
[null,"L7B2,51","L7B",2.5,1,105]
[null,"L7B2,751","L7B",2.75,1,105]
[null,"L7B31","L7B",3,1,105]
[null,"L7B3,251","L7B",3.25,1,105]
[null,"L7B3,51","L7B",3.5,1,105]
[null,"L7B3,751","L7B",3.75,1,105]
[null,"L7B41","L7B",4,1,105]
[null,"L7C0,251","L7C",0.25,1,105]
[null,"L7C0,31251","L7C",0.3125,1,105]
[null,"L7C0,3751","L7C",0.375,1,105]
[null,"L7C0,43751","L7C",0.4375,1,105]
[null,"L7C0,51","L7C",0.5,1,105]
[null,"L7C0,56251","L7C",0.5625,1,105]
[null,"L7C0,6251","L7C",0.625,1,105]
[null,"L7C0,751","L7C",0.75,1,105]
[null,"L7C0,8751","L7C",0.875,1,105]
[null,"L7C11","L7C",1,1,105]
[null,"L7C1,1251","L7C",1.125,1,105]
[null,"L7C1,251","L7C",1.25,1,105]
[null,"L7C1,3751","L7C",1.375,1,105]
[null,"L7C1,51","L7C",1.5,1,105]
[null,"L7C1,6251","L7C",1.625,1,105]
[null,"L7C1,751","L7C",1.75,1,105]
[null,"L7C1,8751","L7C",1.875,1,105]
[null,"L7C21","L7C",2,1,105]
[null,"L7C2,251","L7C",2.25,1,105]
[null,"L7C2,51","L7C",2.5,1,105]
[null,"L7C2,751","L7C",2.75,1,105]
[null,"L7C31","L7C",3,1,105]
[null,"L7C3,251","L7C",3.25,1,105]
[null,"L7C3,51","L7C",3.5,1,105]
[null,"L7C3,751","L7C",3.75,1,105]
[null,"L7C41","L7C",4,1,105]
[null,"L7M0,251","L7M",0.25,1,80]
[null,"L7M0,31251","L7M",0.3125,1,80]
[null,{"$f":"CONCATENATE(C707,D707,E707,)","v":"L7M0,3751"},"L7M",0.375,1,80]
[null,"L7M0,43751","L7M",0.4375,1,80]
[null,"L7M0,51","L7M",0.5,1,80]
[null,"L7M0,56251","L7M",0.5625,1,80]
[null,"L7M0,6251","L7M",0.625,1,80]
[null,"L7M0,751","L7M",0.75,1,80]
[null,"L7M0,8751","L7M",0.875,1,80]
[null,"L7M11","L7M",1,1,80]
[null,"L7M1,1251","L7M",1.125,1,80]
[null,"L7M1,251","L7M",1.25,1,80]
[null,"L7M1,3751","L7M",1.375,1,80]
[null,"L7M1,51","L7M",1.5,1,80]
[null,"L7M1,6251","L7M",1.625,1,80]
[null,"L7M1,751","L7M",1.75,1,80]
[null,"L7M1,8751","L7M",1.875,1,80]
[null,"L7M21","L7M",2,1,80]
[null,"L7M2,251","L7M",2.25,1,80]
[null,"L7M2,51","L7M",2.5,1,80]
[null,"L7M2,751","L7M",2.75,1,80]
[null,"L7M31","L7M",3,1,80]
[null,"L7M3,251","L7M",3.25,1,80]
[null,"L7M3,51","L7M",3.5,1,80]
[null,"L7M3,751","L7M",3.75,1,80]
[null,"L7M41","L7M",4,1,80]
[null,"3.60,251","3.6",0.25,1,26.1067927914,null,0.25,1,26.1067927914]
[null,"3.60,31251","3.6",0.3125,1,26.1067927914,null,0.3125,1,26.1067927914]
[null,"3.60,3751","3.6",0.375,1,26.1067927914,null,0.375,1,26.1067927914]
[null,"3.60,43751","3.6",0.4375,1,26.1067927914,null,0.4375,1,26.1067927914]
[null,"3.60,51","3.6",0.5,1,26.1067927914,null,0.5,1,26.1067927914]
[null,"3.60,56251","3.6",0.5625,1,26.1067927914,null,0.5625,1,26.1067927914]
[null,"3.60,6251","3.6",0.625,1,26.1067927914,null,0.625,1,26.1067927914]
[null,"3.60,751","3.6",0.75,1,26.1067927914,null,0.75,1,26.1067927914]
[null,"3.60,8751","3.6",0.875,1,26.1067927914,null,0.875,1,26.1067927914]
[null,"3.611","3.6",1,1,26.1067927914,null,1,1,26.1067927914]
[null,"3.61,1251","3.6",1.125,1,26.1067927914,null,1.125,1,26.1067927914]
[null,"3.61,251","3.6",1.25,1,26.1067927914,null,1.25,1,26.1067927914]
[null,"3.61,3751","3.6",1.375,1,26.1067927914,null,1.375,1,26.1067927914]
[null,{"$f":"CONCATENATE(C744,D744,E744,)","v":"3.61,51"},"3.6",1.5,1,26.1067927914,null,1.5,1,26.1067927914]
[null,"3.61,6251","3.6",1.625,1,26.1067927914,null,1.625,1,26.1067927914]
[null,"3.61,751","3.6",1.75,1,26.1067927914,null,1.75,1,26.1067927914]
[null,"3.61,8751","3.6",1.875,1,26.1067927914,null,1.875,1,26.1067927914]
[null,"3.621","3.6",2,1,26.1067927914,null,2,1,26.1067927914]
[null,"3.62,251","3.6",2.25,1,26.1067927914,null,2.25,1,26.1067927914]
[null,"3.62,51","3.6",2.5,1,26.1067927914,null,2.5,1,26.1067927914]
[null,"3.62,751","3.6",2.75,1,26.1067927914,null,2.75,1,26.1067927914]
[null,"3.631","3.6",3,1,26.1067927914,null,3,1,26.1067927914]
[null,"3.63,251","3.6",3.25,1,26.1067927914,null,3.25,1,26.1067927914]
[null,"3.63,51","3.6",3.5,1,26.1067927914,null,3.5,1,26.1067927914]
[null,"3.63,751","3.6",3.75,1,26.1067927914,null,3.75,1,26.1067927914]
[null,"3.641","3.6",4,1,26.1067927914,null,4,1,26.1067927914]
[null,"4.60,251","4.6",0.25,1,34.8090570552]
[null,"4.60,31251","4.6",0.3125,1,34.8090570552]
[null,"4.60,3751","4.6",0.375,1,34.8090570552]
[null,"4.60,43751","4.6",0.4375,1,34.8090570552]
[null,"4.60,51","4.6",0.5,1,34.8090570552]
[null,"4.60,56251","4.6",0.5625,1,34.8090570552]
[null,"4.60,6251","4.6",0.625,1,34.8090570552]
[null,"4.60,751","4.6",0.75,1,34.8090570552]
[null,"4.60,8751","4.6",0.875,1,34.8090570552]
[null,"4.611","4.6",1,1,34.8090570552]
[null,"4.61,1251","4.6",1.125,1,34.8090570552]
[null,"4.61,251","4.6",1.25,1,34.8090570552]
[null,"4.61,3751","4.6",1.375,1,34.8090570552]
[null,"4.61,51","4.6",1.5,1,34.8090570552]
[null,"4.61,6251","4.6",1.625,1,34.8090570552]
[null,"4.61,751","4.6",1.75,1,34.8090570552]
[null,"4.61,8751","4.6",1.875,1,34.8090570552]
[null,"4.621","4.6",2,1,34.8090570552]
[null,"4.62,251","4.6",2.25,1,34.8090570552]
[null,"4.62,51","4.6",2.5,1,34.8090570552]
[null,"4.62,751","4.6",2.75,1,34.8090570552]
[null,"4.631","4.6",3,1,34.8090570552]
[null,"4.63,251","4.6",3.25,1,34.8090570552]
[null,"4.63,51","4.6",3.5,1,34.8090570552]
[null,"4.63,751","4.6",3.75,1,34.8090570552]
[null,"4.641","4.6",4,1,34.8090570552]
[null,"4.80,251","4.8",0.25,1,46.412076073599998]
[null,"4.80,31251","4.8",0.3125,1,46.412076073599998]
[null,"4.80,3751","4.8",0.375,1,46.412076073599998]
[null,"4.80,43751","4.8",0.4375,1,46.412076073599998]
[null,"4.80,51","4.8",0.5,1,46.412076073599998]
[null,"4.80,56251","4.8",0.5625,1,46.412076073599998]
[null,"4.80,6251","4.8",0.625,1,46.412076073599998]
[null,"4.80,751","4.8",0.75,1,46.412076073599998]
[null,"4.80,8751","4.8",0.875,1,46.412076073599998]
[null,"4.811","4.8",1,1,46.412076073599998]
[null,"4.81,1251","4.8",1.125,1,46.412076073599998]
[null,"4.81,251","4.8",1.25,1,46.412076073599998]
[null,"4.81,3751","4.8",1.375,1,46.412076073599998]
[null,"4.81,51","4.8",1.5,1,46.412076073599998]
[null,"4.81,6251","4.8",1.625,1,46.412076073599998]
[null,"4.81,751","4.8",1.75,1,46.412076073599998]
[null,"4.81,8751","4.8",1.875,1,46.412076073599998]
[null,"4.821","4.8",2,1,46.412076073599998]
[null,"4.82,251","4.8",2.25,1,46.412076073599998]
[null,"4.82,51","4.8",2.5,1,46.412076073599998]
[null,"4.82,751","4.8",2.75,1,46.412076073599998]
[null,"4.831","4.8",3,1,46.412076073599998]
[null,"4.83,251","4.8",3.25,1,46.412076073599998]
[null,"4.83,51","4.8",3.5,1,46.412076073599998]
[null,"4.83,751","4.8",3.75,1,46.412076073599998]
[null,{"$f":"CONCATENATE(C808,D808,E808,)","v":"4.841"},"4.8",4,1,46.412076073599998]
[null,"5.60,251","5.6",0.25,1,43.511321318999997]
[null,"5.60,31251","5.6",0.3125,1,43.511321318999997]
[null,"5.60,3751","5.6",0.375,1,43.511321318999997]
[null,"5.60,43751","5.6",0.4375,1,43.511321318999997]
[null,"5.60,51","5.6",0.5,1,43.511321318999997]
[null,"5.60,56251","5.6",0.5625,1,43.511321318999997]
[null,"5.60,6251","5.6",0.625,1,43.511321318999997]
[null,"5.60,751","5.6",0.75,1,43.511321318999997]
[null,"5.60,8751","5.6",0.875,1,43.511321318999997]
[null,"5.611","5.6",1,1,43.511321318999997]
[null,"5.61,1251","5.6",1.125,1,43.511321318999997]
[null,"5.61,251","5.6",1.25,1,43.511321318999997]
[null,"5.61,3751","5.6",1.375,1,43.511321318999997]
[null,"5.61,51","5.6",1.5,1,43.511321318999997]
[null,"5.61,6251","5.6",1.625,1,43.511321318999997]
[null,"5.61,751","5.6",1.75,1,43.511321318999997]
[null,"5.61,8751","5.6",1.875,1,43.511321318999997]
[null,"5.621","5.6",2,1,43.511321318999997]
[null,"5.62,251","5.6",2.25,1,43.511321318999997]
[null,"5.62,51","5.6",2.5,1,43.511321318999997]
[null,"5.62,751","5.6",2.75,1,43.511321318999997]
[null,"5.631","5.6",3,1,43.511321318999997]
[null,"5.63,251","5.6",3.25,1,43.511321318999997]
[null,"5.63,51","5.6",3.5,1,43.511321318999997]
[null,"5.63,751","5.6",3.75,1,43.511321318999997]
[null,"5.641","5.6",4,1,43.511321318999997]
[null,"5.80,251","5.8",0.25,1,58.015095092000003]
[null,"5.80,31251","5.8",0.3125,1,58.015095092000003]
[null,"5.80,3751","5.8",0.375,1,58.015095092000003]
[null,"5.80,43751","5.8",0.4375,1,58.015095092000003]
[null,"5.80,51","5.8",0.5,1,58.015095092000003]
[null,"5.80,56251","5.8",0.5625,1,58.015095092000003]
[null,"5.80,6251","5.8",0.625,1,58.015095092000003]
[null,"5.80,751","5.8",0.75,1,58.015095092000003]
[null,"5.80,8751","5.8",0.875,1,58.015095092000003]
[null,"5.811","5.8",1,1,58.015095092000003]
[null,"5.81,1251","5.8",1.125,1,58.015095092000003]
[null,"5.81,251","5.8",1.25,1,58.015095092000003]
[null,"5.81,3751","5.8",1.375,1,58.015095092000003]
[null,"5.81,51","5.8",1.5,1,58.015095092000003]
[null,"5.81,6251","5.8",1.625,1,58.015095092000003]
[null,"5.81,751","5.8",1.75,1,58.015095092000003]
[null,"5.81,8751","5.8",1.875,1,58.015095092000003]
[null,"5.821","5.8",2,1,58.015095092000003]
[null,"5.82,251","5.8",2.25,1,58.015095092000003]
[null,"5.82,51","5.8",2.5,1,58.015095092000003]
[null,"5.82,751","5.8",2.75,1,58.015095092000003]
[null,"5.831","5.8",3,1,58.015095092000003]
[null,"5.83,251","5.8",3.25,1,58.015095092000003]
[null,"5.83,51","5.8",3.5,1,58.015095092000003]
[null,"5.83,751","5.8",3.75,1,58.015095092000003]
[null,"5.841","5.8",4,1,58.015095092000003]
[null,"6.80,251","6.8",0.25,1,69.618114110400001]
[null,"6.80,31251","6.8",0.3125,1,69.618114110400001]
[null,"6.80,3751","6.8",0.375,1,69.618114110400001]
[null,"6.80,43751","6.8",0.4375,1,69.618114110400001]
[null,"6.80,51","6.8",0.5,1,69.618114110400001]
[null,"6.80,56251","6.8",0.5625,1,69.618114110400001]
[null,"6.80,6251","6.8",0.625,1,69.618114110400001]
[null,"6.80,751","6.8",0.75,1,69.618114110400001]
[null,"6.80,8751","6.8",0.875,1,69.618114110400001]
[null,"6.811","6.8",1,1,69.618114110400001]
[null,"6.81,1251","6.8",1.125,1,69.618114110400001]
[null,{"$f":"CONCATENATE(C872,D872,E872,)","v":"6.81,251"},"6.8",1.25,1,69.618114110400001]
[null,"6.81,3751","6.8",1.375,1,69.618114110400001]
[null,"6.81,51","6.8",1.5,1,69.618114110400001]
[null,"6.81,6251","6.8",1.625,1,69.618114110400001]
[null,"6.81,751","6.8",1.75,1,69.618114110400001]
[null,"6.81,8751","6.8",1.875,1,69.618114110400001]
[null,"6.821","6.8",2,1,69.618114110400001]
[null,"6.82,251","6.8",2.25,1,69.618114110400001]
[null,"6.82,51","6.8",2.5,1,69.618114110400001]
[null,"6.82,751","6.8",2.75,1,69.618114110400001]
[null,"6.831","6.8",3,1,69.618114110400001]
[null,"6.83,251","6.8",3.25,1,69.618114110400001]
[null,"6.83,51","6.8",3.5,1,69.618114110400001]
[null,"6.83,751","6.8",3.75,1,69.618114110400001]
[null,"6.841","6.8",4,1,69.618114110400001]
[null,"8.80,251","8.8",0.25,1,92.824152147199996]
[null,"8.80,31251","8.8",0.3125,1,92.824152147199996]
[null,"8.80,3751","8.8",0.375,1,92.824152147199996]
[null,"8.80,43751","8.8",0.4375,1,92.824152147199996]
[null,"8.80,51","8.8",0.5,1,92.824152147199996]
[null,"8.80,56251","8.8",0.5625,1,92.824152147199996]
[null,"8.80,6251","8.8",0.625,1,92.824152147199996]
[null,"8.80,751","8.8",0.75,1,92.824152147199996]
[null,"8.80,8751","8.8",0.875,1,92.824152147199996]
[null,"8.811","8.8",1,1,92.824152147199996]
[null,"8.81,1251","8.8",1.125,1,92.824152147199996]
[null,"8.81,251","8.8",1.25,1,92.824152147199996]
[null,"8.81,3751","8.8",1.375,1,92.824152147199996]
[null,"8.81,51","8.8",1.5,1,92.824152147199996]
[null,"8.81,6251","8.8",1.625,1,92.824152147199996]
[null,"8.81,751","8.8",1.75,1,92.824152147199996]
[null,"8.81,8751","8.8",1.875,1,92.824152147199996]
[null,"8.821","8.8",2,1,92.824152147199996]
[null,"8.82,251","8.8",2.25,1,92.824152147199996]
[null,"8.82,51","8.8",2.5,1,92.824152147199996]
[null,"8.82,751","8.8",2.75,1,92.824152147199996]
[null,"8.831","8.8",3,1,92.824152147199996]
[null,"8.83,251","8.8",3.25,1,92.824152147199996]
[null,"8.83,51","8.8",3.5,1,92.824152147199996]
[null,"8.83,751","8.8",3.75,1,92.824152147199996]
[null,"8.841","8.8",4,1,92.824152147199996]
[null,"9.80,251","9.8",0.25,1,104.4271711656]
[null,"9.80,31251","9.8",0.3125,1,104.4271711656]
[null,"9.80,3751","9.8",0.375,1,104.4271711656]
[null,"9.80,43751","9.8",0.4375,1,104.4271711656]
[null,"9.80,51","9.8",0.5,1,104.4271711656]
[null,"9.80,56251","9.8",0.5625,1,104.4271711656]
[null,"9.80,6251","9.8",0.625,1,104.4271711656]
[null,"9.80,751","9.8",0.75,1,104.4271711656]
[null,"9.80,8751","9.8",0.875,1,104.4271711656]
[null,"9.811","9.8",1,1,104.4271711656]
[null,"9.81,1251","9.8",1.125,1,104.4271711656]
[null,"9.81,251","9.8",1.25,1,104.4271711656]
[null,"9.81,3751","9.8",1.375,1,104.4271711656]
[null,"9.81,51","9.8",1.5,1,104.4271711656]
[null,"9.81,6251","9.8",1.625,1,104.4271711656]
[null,"9.81,751","9.8",1.75,1,104.4271711656]
[null,"9.81,8751","9.8",1.875,1,104.4271711656]
[null,"9.821","9.8",2,1,104.4271711656]
[null,"9.82,251","9.8",2.25,1,104.4271711656]
[null,"9.82,51","9.8",2.5,1,104.4271711656]
[null,"9.82,751","9.8",2.75,1,104.4271711656]
[null,"9.831","9.8",3,1,104.4271711656]
[null,"9.83,251","9.8",3.25,1,104.4271711656]
[null,{"$f":"CONCATENATE(C936,D936,E936,)","v":"9.83,51"},"9.8",3.5,1,104.4271711656]
[null,"9.83,751","9.8",3.75,1,104.4271711656]
[null,"9.841","9.8",4,1,104.4271711656]
[null,"10.90,251","10.9",0.25,1,130.533963957]
[null,"10.90,31251","10.9",0.3125,1,130.533963957]
[null,"10.90,3751","10.9",0.375,1,130.533963957]
[null,"10.90,43751","10.9",0.4375,1,130.533963957]
[null,"10.90,51","10.9",0.5,1,130.533963957]
[null,"10.90,56251","10.9",0.5625,1,130.533963957]
[null,"10.90,6251","10.9",0.625,1,130.533963957]
[null,"10.90,751","10.9",0.75,1,130.533963957]
[null,"10.90,8751","10.9",0.875,1,130.533963957]
[null,"10.911","10.9",1,1,130.533963957]
[null,"10.91,1251","10.9",1.125,1,130.533963957]
[null,"10.91,251","10.9",1.25,1,130.533963957]
[null,"10.91,3751","10.9",1.375,1,130.533963957]
[null,"10.91,51","10.9",1.5,1,130.533963957]
[null,"10.91,6251","10.9",1.625,1,130.533963957]
[null,"10.91,751","10.9",1.75,1,130.533963957]
[null,"10.91,8751","10.9",1.875,1,130.533963957]
[null,"10.921","10.9",2,1,130.533963957]
[null,"10.92,251","10.9",2.25,1,130.533963957]
[null,"10.92,51","10.9",2.5,1,130.533963957]
[null,"10.92,751","10.9",2.75,1,130.533963957]
[null,"10.931","10.9",3,1,130.533963957]
[null,"10.93,251","10.9",3.25,1,130.533963957]
[null,"10.93,51","10.9",3.5,1,130.533963957]
[null,"10.93,751","10.9",3.75,1,130.533963957]
[null,"10.941","10.9",4,1,130.533963957]
[null,"12.90,251","12.9",0.25,1,156.64075674840001]
[null,"12.90,31251","12.9",0.3125,1,156.64075674840001]
[null,"12.90,3751","12.9",0.375,1,156.64075674840001]
[null,"12.90,43751","12.9",0.4375,1,156.64075674840001]
[null,"12.90,51","12.9",0.5,1,156.64075674840001]
[null,"12.90,56251","12.9",0.5625,1,156.64075674840001]
[null,"12.90,6251","12.9",0.625,1,156.64075674840001]
[null,"12.90,751","12.9",0.75,1,156.64075674840001]
[null,"12.90,8751","12.9",0.875,1,156.64075674840001]
[null,"12.911","12.9",1,1,156.64075674840001]
[null,"12.91,1251","12.9",1.125,1,156.64075674840001]
[null,"12.91,251","12.9",1.25,1,156.64075674840001]
[null,"12.91,3751","12.9",1.375,1,156.64075674840001]
[null,"12.91,51","12.9",1.5,1,156.64075674840001]
[null,"12.91,6251","12.9",1.625,1,156.64075674840001]
[null,"12.91,751","12.9",1.75,1,156.64075674840001]
[null,"12.91,8751","12.9",1.875,1,156.64075674840001]
[null,"12.921","12.9",2,1,156.64075674840001]
[null,"12.92,251","12.9",2.25,1,156.64075674840001]
[null,"12.92,51","12.9",2.5,1,156.64075674840001]
[null,"12.92,751","12.9",2.75,1,156.64075674840001]
[null,"12.931","12.9",3,1,156.64075674840001]
[null,"12.93,251","12.9",3.25,1,156.64075674840001]
[null,"12.93,51","12.9",3.5,1,156.64075674840001]
[null,"12.93,751","12.9",3.75,1,156.64075674840001]
[null,"12.941","12.9",4,1,156.64075674840001]
[null,"A2/A4-700,251","A2/A4-70",0.25,1,65.266981978499999]
[null,"A2/A4-700,31251","A2/A4-70",0.3125,1,65.266981978499999]
[null,"A2/A4-700,3751","A2/A4-70",0.375,1,65.266981978499999]
[null,"A2/A4-700,43751","A2/A4-70",0.4375,1,65.266981978499999]
[null,"A2/A4-700,51","A2/A4-70",0.5,1,65.266981978499999]
[null,"A2/A4-700,56251","A2/A4-70",0.5625,1,65.266981978499999]
[null,"A2/A4-700,6251","A2/A4-70",0.625,1,65.266981978499999]
[null,"A2/A4-700,751","A2/A4-70",0.75,1,65.266981978499999]
[null,"A2/A4-700,8751","A2/A4-70",0.875,1,65.266981978499999]
[null,{"$f":"CONCATENATE(C1000,D1000,E1000,)","v":"A2/A4-7011"},"A2/A4-70",1,1,65.266981978499999]
[null,"A2/A4-701,1251","A2/A4-70",1.125,1,65.266981978499999]
[null,"A2/A4-701,251","A2/A4-70",1.25,1,65.266981978499999]
[null,"A2/A4-701,3751","A2/A4-70",1.375,1,65.266981978499999]
[null,"A2/A4-701,51","A2/A4-70",1.5,1,65.266981978499999]
[null,"A2/A4-701,6251","A2/A4-70",1.625,1,65.266981978499999]
[null,"A2/A4-701,751","A2/A4-70",1.75,1,65.266981978499999]
[null,"A2/A4-701,8751","A2/A4-70",1.875,1,65.266981978499999]
[null,"A2/A4-7021","A2/A4-70",2,1,65.266981978499999]
[null,"A2/A4-702,251","A2/A4-70",2.25,1,65.266981978499999]
[null,"A2/A4-702,51","A2/A4-70",2.5,1,65.266981978499999]
[null,"A2/A4-702,751","A2/A4-70",2.75,1,65.266981978499999]
[null,"A2/A4-7031","A2/A4-70",3,1,65.266981978499999]
[null,"A2/A4-703,251","A2/A4-70",3.25,1,65.266981978499999]
[null,"A2/A4-703,51","A2/A4-70",3.5,1,65.266981978499999]
[null,"A2/A4-703,751","A2/A4-70",3.75,1,65.266981978499999]
[null,"A2/A4-7041","A2/A4-70",4,1,65.266981978499999]
[null,"25CrMo40,251","25CrMo4",0.25,1,63.816604601199998]
[null,"25CrMo40,31251","25CrMo4",0.3125,1,63.816604601199998]
[null,"25CrMo40,3751","25CrMo4",0.375,1,63.816604601199998]
[null,"25CrMo40,43751","25CrMo4",0.4375,1,63.816604601199998]
[null,"25CrMo40,51","25CrMo4",0.5,1,63.816604601199998]
[null,"25CrMo40,56251","25CrMo4",0.5625,1,63.816604601199998]
[null,"25CrMo40,6251","25CrMo4",0.625,1,63.816604601199998]
[null,"25CrMo40,751","25CrMo4",0.75,1,63.816604601199998]
[null,"25CrMo40,8751","25CrMo4",0.875,1,63.816604601199998]
[null,"25CrMo411","25CrMo4",1,1,63.816604601199998]
[null,"25CrMo41,1251","25CrMo4",1.125,1,63.816604601199998]
[null,"25CrMo41,251","25CrMo4",1.25,1,63.816604601199998]
[null,"25CrMo41,3751","25CrMo4",1.375,1,63.816604601199998]
[null,"25CrMo41,51","25CrMo4",1.5,1,63.816604601199998]
[null,"25CrMo41,6251","25CrMo4",1.625,1,63.816604601199998]
[null,"25CrMo41,751","25CrMo4",1.75,1,63.816604601199998]
[null,"25CrMo41,8751","25CrMo4",1.875,1,63.816604601199998]
[null,"25CrMo421","25CrMo4",2,1,63.816604601199998]
[null,"25CrMo42,251","25CrMo4",2.25,1,63.816604601199998]
[null,"25CrMo42,51","25CrMo4",2.5,1,63.816604601199998]
[null,"25CrMo42,751","25CrMo4",2.75,1,63.816604601199998]
[null,"25CrMo431","25CrMo4",3,1,63.816604601199998]
[null,"25CrMo43,251","25CrMo4",3.25,1,63.816604601199998]
[null,"25CrMo43,51","25CrMo4",3.5,1,63.816604601199998]
[null,"25CrMo43,751","25CrMo4",3.75,1,63.816604601199998]
[null,"25CrMo441","25CrMo4",4,1,63.816604601199998]
[null,"42CrMo40,251","42CrMo4",0.25,1,105.8775485429]
[null,"42CrMo40,31251","42CrMo4",0.3125,1,105.8775485429]
[null,"42CrMo40,3751","42CrMo4",0.375,1,105.8775485429]
[null,"42CrMo40,43751","42CrMo4",0.4375,1,105.8775485429]
[null,"42CrMo40,51","42CrMo4",0.5,1,105.8775485429]
[null,"42CrMo40,56251","42CrMo4",0.5625,1,105.8775485429]
[null,"42CrMo40,6251","42CrMo4",0.625,1,105.8775485429]
[null,"42CrMo40,751","42CrMo4",0.75,1,105.8775485429]
[null,"42CrMo40,8751","42CrMo4",0.875,1,105.8775485429]
[null,"42CrMo411","42CrMo4",1,1,105.8775485429]
[null,"42CrMo41,1251","42CrMo4",1.125,1,105.8775485429]
[null,"42CrMo41,251","42CrMo4",1.25,1,105.8775485429]
[null,"42CrMo41,3751","42CrMo4",1.375,1,105.8775485429]
[null,"42CrMo41,51","42CrMo4",1.5,1,105.8775485429]
[null,"42CrMo41,6251","42CrMo4",1.625,1,105.8775485429]
[null,"42CrMo41,751","42CrMo4",1.75,1,105.8775485429]
[null,"42CrMo41,8751","42CrMo4",1.875,1,105.8775485429]
[null,"42CrMo421","42CrMo4",2,1,105.8775485429]
[null,"42CrMo42,251","42CrMo4",2.25,1,105.8775485429]
[null,"42CrMo42,51","42CrMo4",2.5,1,105.8775485429]
[null,"42CrMo42,751","42CrMo4",2.75,1,105.8775485429]
[null,{"$f":"CONCATENATE(C1064,D1064,E1064,)","v":"42CrMo431"},"42CrMo4",3,1,105.8775485429]
[null,"42CrMo43,251","42CrMo4",3.25,1,105.8775485429]
[null,"42CrMo43,51","42CrMo4",3.5,1,105.8775485429]
[null,"42CrMo43,751","42CrMo4",3.75,1,105.8775485429]
[null,"42CrMo441","42CrMo4",4,1,105.8775485429]
[null,"I7180,251","I718",0.25,1,150]
[null,"I7180,31251","I718",0.3125,1,150]
[null,"I7180,3751","I718",0.375,1,150]
[null,"I7180,43751","I718",0.4375,1,150]
[null,"I7180,51","I718",0.5,1,150]
[null,"I7180,56251","I718",0.5625,1,150]
[null,"I7180,6251","I718",0.625,1,150]
[null,"I7180,751","I718",0.75,1,150]
[null,"I7180,8751","I718",0.875,1,150]
[null,"I71811","I718",1,1,150]
[null,"I7181,1251","I718",1.125,1,150]
[null,"I7181,251","I718",1.25,1,150]
[null,"I7181,3751","I718",1.375,1,150]
[null,"I7181,51","I718",1.5,1,150]
[null,"I7181,6251","I718",1.625,1,150]
[null,"I7181,751","I718",1.75,1,150]
[null,"I7181,8751","I718",1.875,1,150]
[null,"I71821","I718",2,1,150]
[null,"I7182,251","I718",2.25,1,150]
[null,"I7182,51","I718",2.5,1,150]
[null,"I7182,751","I718",2.75,1,150]
[null,"I71831","I718",3,1,150]
[null,"I7183,251","I718",3.25,1,150]
[null,"I7183,51","I718",3.5,1,150]
[null,"I7183,751","I718",3.75,1,150]
[null,"I71841","I718",4,1,150]